program: Gaussian 09
title: 000254843
version: EM64L-G09RevD.01
frameworkgroup: C1[X(C10H11N5O3)]
method: RPBEPBE
basis: SDD
operation: Freq
keyword: #p
keyword: freq=noraman
keyword: PBEPBE/SDD
title: #p freq=noraman PBEPBE/SDD
converged: YES YES NO NO
title: Mulliken charges:
elementType: O O O N N N N N C C C C C C C C C C H H H H H H H H H H H
charge: -0.232922 -0.269078 -0.443342 -0.166754 -0.079990 -0.056911 -0.059337 -0.607985 -0.250529 -0.157111 -0.127452 -0.047464 -0.354128 0.148014 -0.193006 -0.101022 0.169738 -0.360414 0.300122 0.269988 0.331677 0.244070 0.240360 0.244955 0.359423 0.269139 0.248657 0.335363 0.345940
chargesum: 0.00000
title: Mulliken charges with hydrogens summed into heavy atoms:
elementType: O O O N N N N N C C C C C C C C C C
charge: -0.232922 -0.269078 -0.083919 -0.166754 -0.079990 -0.056911 -0.059337 0.073318 0.049594 0.112877 0.204225 0.196606 0.131187 0.148014 0.076133 -0.101022 0.169738 -0.111756
polarizability: 2.06175070e+02 -4.84293772e+00 1.50263934e+02 -1.72530452e+00 9.76895185e-01 8.46979365e+01
1716.lowfreq: -24.0853 -0.0008 -0.0002 0.0004 3.6746 6.6067 12.0954 53.2038 86.5896
frequency: -18.9546 52.9754 86.5550 136.4611 158.7679 203.3392 213.1439 233.0745 266.9464 278.7390 326.6128 336.4722 350.8952 426.2015 463.4793 511.3122 522.9836 526.1585 547.9642 550.1728 563.0284 594.0320 646.0873 655.0350 667.5528 700.2248 724.3677 778.1818 791.0550 794.1869 802.8214 821.6095 831.6971 832.5780 863.3525 887.5132 932.5995 948.5976 960.0443 969.0011 1004.0013 1011.6166 1020.3033 1034.8882 1046.4905 1110.9412 1151.9848 1160.1724 1177.6193 1196.2826 1216.7151 1220.4639 1233.3485 1254.5505 1264.1592 1271.1574 1280.3370 1303.4704 1305.7071 1318.0483 1350.6572 1379.4360 1381.0576 1393.2074 1438.3716 1463.0237 1466.7908 1543.3171 1579.8848 1634.0304 3023.4087 3026.2179 3098.0421 3138.4627 3148.2319 3158.3784 3167.9657 3230.2425 3510.9164 3538.9891 3693.7938
redmass: 6.1999 5.5750 6.1118 5.9813 6.6134 5.5355 4.7621 4.6719 5.0591 4.5692 5.0797 5.4713 4.1137 3.1102 1.1907 8.8232 1.4212 3.1706 4.2824 1.0867 4.1700 6.3835 4.4258 5.8129 8.7740 6.9950 5.6030 5.0997 3.8888 5.8437 4.3462 2.3570 3.8671 3.5173 7.7211 3.7524 1.4294 2.8552 2.5540 3.8054 2.0019 2.1744 2.4071 2.3292 3.4258 1.3592 2.4108 2.3204 1.9414 1.8188 1.5131 1.3654 1.7461 1.7746 2.0295 1.5179 1.4393 4.8246 1.5076 5.2670 2.3214 1.4399 1.3059 3.9594 2.8905 3.9510 1.0946 6.6455 1.8877 2.7743 1.0586 1.0855 1.1095 1.0889 1.0905 1.0943 1.0922 1.0987 1.0652 1.0443 1.1056
irintensity: 0.1741 1.7887 0.9425 1.8215 2.8091 5.4556 5.8617 11.9765 3.5712 8.6463 18.0750 7.2880 1.5601 5.4829 94.9667 4.0678 216.3673 55.1997 3.7279 0.7694 0.7019 6.7975 43.2251 10.0878 6.0201 4.9154 36.8633 5.5109 36.6714 18.5169 48.3375 6.1100 4.2745 98.8769 12.8700 60.7823 11.5914 19.5222 0.5748 106.5438 4.9060 0.7477 8.8768 12.5461 123.2679 10.7479 5.9338 10.9807 10.3393 66.0600 13.7937 29.9704 96.2907 7.7528 44.3511 13.4786 9.2876 45.8659 4.5053 51.5479 154.6988 12.7711 19.9245 10.8144 62.5423 40.8877 4.5847 60.6894 31.8630 622.7843 49.3584 21.2038 16.0162 1.1991 14.8672 0.5173 12.4881 0.1786 11.1190 134.3200 51.3755
temp: 298.150 k
press: 1.00000 atm
elementType: 8 8 8 7 7 7 7 7 6 6 6 6 6 6 6 6 6 6 1 1 1 1 1 1 1 1 1 1 1
symmnumber: 1
zpe: 573624.4 jmol-1
zpe.correction: 0.218482 hartree
zpe.thermalcorrener: 0.231632 hartree
zpe.thermalcorrenthalpy: 0.232576 hartree
zpe.thermalcorrgfe: 0.179111 hartree
zpe.sumelectzpe: -885.747586 hartree
zpe.sumelectthermal: -885.734436 hartree
zpe.sumelectthermalent: -885.733492 hartree
zpe.sumelectthermalfe: -885.786957 hartree
dipole: 0.0945 -2.3900 -0.3780
dipole: 2.4216
quadrupole: -83.4593 -110.0915 -106.8979
quadrupole: -1.7122 1.3900 0.0843
quadrupole: 16.6902 -9.9419 -6.7483 -1.7122 1.3900 0.0843
hfenergy: -885.9660682 hartree
pointgroup: C01 [X(C10H11N5O3)]
dipole: -0.093813 0.5932543 -0.7395327 debye
polarizability: 205.2056027|8.2841879|120.7825449|10.0566374|-31.7756624|115.1487932 unknown
InChI: InChI=1S/C10H11N5O3/c11-8-5-9(13-2-12-8)15(3-14-5)10-7-6(16)4(18-10)1-17-7/h2-4,6-7,10,16H,1,11H2
charge 0 multiplicity 1
29 atoms
O  -2.025786 1.413748 0.11013
O  -3.266554 -0.937447 -1.089066
O  -3.009176 -1.879304 1.544362
N  0.129291 0.683159 -0.773131
N  2.129552 1.730666 -1.226393
N  0.941519 -0.977258 0.915855
N  3.362698 -0.782433 1.308377
N  4.713054 0.813234 0.205977
C  -1.89172 -0.897162 -0.479689
C  -3.043618 0.542821 0.7760
C  -2.236573 -0.768363 1.026124
C  -1.311704 0.489559 -0.850259
C  -4.056312 0.094767 -0.296844
C  1.093914 0.058187 0.040344
C  0.819093 1.679275 -1.499396
C  2.315289 0.717269 -0.264961
C  3.481372 0.257106 0.414599
C  2.125753 -1.330127 1.503579
H  -1.335006 -1.779506 -0.813337
H  -3.439507 1.079114 1.646054
H  -1.36145 -0.637684 1.673287
H  -1.62542 0.760232 -1.875466
H  -4.954696 -0.395431 0.116443
H  -4.339713 0.922002 -0.967744
H  -3.540871 -2.265451 0.798174
H  0.299134 2.331335 -2.198602
H  2.078351 -2.154409 2.221156
H  5.513094 0.446451 0.717548
H  4.817593 1.584748 -0.449722
