program: Gaussian 09
title: 000254838
version: EM64L-G09RevD.01
frameworkgroup: C1[X(C16H18N6O2)]
method: RPBEPBE
basis: SDD
operation: Freq
keyword: #p
keyword: freq=noraman
keyword: PBEPBE/SDD
title: #p freq=noraman PBEPBE/SDD
converged: YES YES NO NO
title: Mulliken charges:
elementType: O O N N N N N N C C C C C C C C C C C C C C C C H H H H H H H H H H H H H H H H H H
charge: -0.261075 -0.260666 -0.213677 -0.214057 -0.368320 -0.368502 0.008791 0.008839 -0.406134 -0.407510 0.303686 0.304899 -0.290303 -0.290657 0.270263 0.269894 -0.511646 -0.511538 -0.331688 -0.331618 -0.258683 -0.258660 -0.276244 -0.276348 0.232749 0.250068 0.232793 0.250406 0.244716 0.245031 0.228492 0.290578 0.228532 0.290499 0.305406 0.304613 0.297222 0.297184 0.232310 0.232318 0.254017 0.254019
chargesum: 0.00000
title: Mulliken charges with hydrogens summed into heavy atoms:
elementType: O O N N N N N N C C C C C C C C C C C C C C C C
charge: -0.261075 -0.260666 -0.213677 -0.214057 -0.071098 -0.071318 0.008791 0.008839 0.076683 0.075689 0.303686 0.304899 -0.045587 -0.045626 0.270263 0.269894 0.007424 0.007493 -0.026282 -0.027005 -0.026373 -0.026341 -0.022228 -0.022329
polarizability: 3.17139552e+02 -4.80882792e-02 2.28554282e+02 2.23985795e+01 5.56928488e-02 1.41328036e+02
1716.lowfreq: -9.3258 -6.6618 -1.1869 0.0002 0.0005 0.0007 7.7423 27.1942 31.3502
frequency: -7.2156 27.1271 31.1943 46.8003 71.7688 72.5358 78.1068 90.3157 108.5202 150.7249 160.6857 184.0358 220.5813 223.6930 289.1355 308.3399 346.7245 349.7404 354.7244 363.7598 394.9212 405.3395 416.9485 421.1661 470.7209 491.7766 494.5535 512.5985 547.3497 548.5534 566.7335 607.1870 625.1075 654.2058 665.8766 711.6434 730.3935 745.1794 746.0646 761.2364 761.4117 766.3932 777.0726 829.6548 836.4112 836.9661 841.7964 874.9130 914.5304 938.7216 943.5691 946.8803 960.3220 973.8161 978.9798 988.7807 988.9248 995.7731 1003.3949 1005.0623 1049.6551 1053.8137 1060.6641 1083.2043 1083.9406 1120.7863 1128.6046 1144.4125 1145.0998 1184.9497 1190.8356 1222.6082 1225.8663 1234.9021 1237.2948 1237.8020 1267.6610 1268.6140 1281.6294 1283.9694 1284.2512 1295.9772 1307.9964 1336.6944 1345.6069 1355.7748 1374.6974 1376.8535 1387.7336 1392.5687 1440.8610 1463.8220 1464.1778 1472.7294 1479.3894 1485.7360 1560.6634 1560.7575 1580.2428 1586.2829 1594.4803 1609.9567 2933.9285 2934.3357 2987.6679 2994.1278 2994.2382 3001.0009 3064.4914 3064.5432 3118.6870 3124.2395 3140.8386 3163.0554 3207.8344 3207.8682 3214.9712 3217.5129 3559.1269 3559.2189
redmass: 5.2170 7.7931 5.9308 5.0298 3.6884 6.2928 4.4419 4.3926 3.6532 4.2642 4.7556 4.3724 4.2633 5.6573 3.7395 4.0826 3.7210 3.0890 3.8628 3.4773 3.4460 1.5920 1.7496 5.4635 3.3854 3.5101 3.4737 3.7978 4.5131 5.2333 4.3257 6.0029 4.1608 6.3084 3.9225 6.4150 4.2747 3.1264 3.1878 1.2646 1.2742 1.4631 3.4722 4.3074 6.2280 5.8173 3.2922 1.4083 2.8962 2.9601 2.1470 2.4683 1.3731 2.1619 2.1703 3.2694 1.3278 2.5052 6.0330 5.2419 2.5343 2.5482 2.3451 3.4623 2.3621 2.5503 2.3491 1.2986 1.3307 1.0725 1.5490 1.3803 1.3239 2.5324 1.5974 2.1831 1.3838 1.3978 1.8544 1.5279 1.4808 1.6697 1.5713 2.0419 2.0609 1.5834 1.3711 2.2316 1.6448 1.4052 2.3466 1.1320 1.1148 1.2300 1.1103 1.9526 5.1861 5.1879 6.6539 8.2697 8.8586 6.7733 1.0844 1.0844 1.0716 1.0635 1.0635 1.0686 1.0989 1.0989 1.0942 1.0902 1.0872 1.0967 1.0956 1.0956 1.0926 1.0941 1.0789 1.0789
irintensity: 6.7674 1.4675 1.6293 0.3833 0.3148 1.0605 3.0822 2.7548 1.3088 0.7293 2.3875 2.4001 0.2701 0.6235 0.1919 5.7763 1.6995 11.8886 8.9982 15.4670 3.0886 231.9063 130.7742 2.2874 9.8913 13.5595 9.1947 0.6848 0.2619 12.0558 1.9962 1.1174 0.9597 1.0310 22.1067 0.1600 0.0157 13.5384 2.1180 11.4109 71.6540 75.3368 29.9439 0.0053 19.4595 1.0641 1.2233 0.8391 38.0483 0.3399 97.3428 2.8693 5.0402 2.0737 8.0972 17.3496 0.4813 2.6532 0.8431 82.7860 3.4330 14.7845 12.8945 0.2213 0.1604 46.7299 32.5281 43.6492 49.1385 0.6742 260.2461 33.7232 6.6400 32.2133 18.3561 5.4295 3.3582 1.3655 328.0677 41.1012 0.3331 19.3480 4.2661 227.4096 49.9491 19.3575 23.6345 0.1964 15.3206 106.0653 30.4481 15.4436 43.4346 15.9493 5.7980 139.7444 14.5638 10.4057 2.8104 438.0755 7.5412 9.1223 83.9632 23.2250 20.3016 35.2629 14.6043 27.5997 11.0704 19.0219 7.7362 25.3436 5.4376 24.5833 5.1896 3.6691 8.9761 8.2111 6.7014 8.7491
temp: 298.150 k
press: 1.00000 atm
elementType: 8 8 7 7 7 7 7 7 6 6 6 6 6 6 6 6 6 6 6 6 6 6 6 6 1 1 1 1 1 1 1 1 1 1 1 1 1 1 1 1 1 1
symmnumber: 1
zpe: 866758.4 jmol-1
zpe.correction: 0.330131 hartree
zpe.thermalcorrener: 0.349940 hartree
zpe.thermalcorrenthalpy: 0.350884 hartree
zpe.thermalcorrgfe: 0.280412 hartree
zpe.sumelectzpe: -1097.636395 hartree
zpe.sumelectthermal: -1097.616586 hartree
zpe.sumelectthermalent: -1097.615642 hartree
zpe.sumelectthermalfe: -1097.686114 hartree
dipole: -0.0070 -4.1304 -0.0436
dipole: 4.1306
quadrupole: -160.2342 -133.5263 -149.1663
quadrupole: 0.0045 18.6175 0.0335
quadrupole: -12.5920 14.1160 -1.5240 0.0045 18.6175 0.0335
hfenergy: -1097.966526 hartree
pointgroup: C01 [X(C16H18N6O2)]
dipole: 0.0022626 1.6250269 -0.0162145 debye
polarizability: 313.0426989|-0.0672278|228.5543579|-34.7157066|0.0192659|145.4248128 unknown
InChI: InChI=1S/C16H18N6O2/c23-15(11-5-7-17-19-11)21-9-10-22(14-4-2-1-3-13(14)21)16(24)12-6-8-18-20-12/h1-4,7-8,11-12,19-20H,5-6,9-10H2
charge 0 multiplicity 1
42 atoms
O  3.414369 -0.979906 -1.181306
O  -3.406218 -0.974795 1.195977
N  1.448466 -0.125727 -0.211882
N  -1.449843 -0.125885 0.203414
N  3.725188 1.768679 0.809395
N  -3.732652 1.765612 -0.807377
N  5.047175 2.240145 0.967293
N  -5.055082 2.23833 -0.957382
C  0.705537 1.048852 0.287918
C  -0.709295 1.0452 -0.307457
C  0.7134 -1.372625 -0.116347
C  -0.714371 -1.372651 0.11154
C  3.427641 1.399897 -0.619024
C  -3.425284 1.401848 0.620121
C  2.760905 -0.006728 -0.704831
C  -2.758527 -0.004678 0.70565
C  4.850858 1.395283 -1.256373
C  -4.843996 1.40004 1.26737
C  1.388345 -2.618859 -0.211856
C  -1.389394 -2.6185 0.20998
C  0.696471 -3.837978 -0.101793
C  -0.697538 -3.8379 0.103258
C  5.694198 2.033379 -0.162034
C  -5.694315 2.035996 0.177184
H  1.208055 1.977779 -0.011576
H  0.641451 1.020364 1.393517
H  -1.213082 1.976199 -0.016765
H  -0.645493 1.006387 -1.412742
H  2.791221 2.161656 -1.117737
H  -2.785239 2.165257 1.111592
H  4.897753 1.949352 -2.209114
H  5.152433 0.349257 -1.458881
H  -4.883818 1.956623 2.218973
H  -5.145109 0.354786 1.474576
H  2.46136 -2.617347 -0.393845
H  -2.462458 -2.616535 0.391762
H  3.041262 2.256617 1.389464
H  -3.052121 2.249796 -1.394541
H  1.252751 -4.777783 -0.178807
H  -1.25366 -4.77759 0.182685
H  6.758724 2.261661 -0.227149
H  -6.75807 2.265794 0.249145
