program: Gaussian 09
title: 000254837
version: EM64L-G09RevD.01
frameworkgroup: C1[X(C13H15NO2)]
method: RPBEPBE
basis: SDD
operation: Freq
keyword: #p
keyword: freq=noraman
keyword: PBEPBE/SDD
title: #p freq=noraman PBEPBE/SDD
converged: YES YES NO NO
title: Mulliken charges:
elementType: O O N C C C C C C C C C C C C C H H H H H H H H H H H H H H H
charge: -0.267302 -0.271936 -0.235584 -0.412242 -0.524259 -0.406299 0.349937 0.262281 -0.537029 -0.339217 0.170193 0.324524 -0.382961 -0.188306 -0.536089 -0.523704 0.210034 0.229402 0.222253 0.235325 0.224081 0.228469 0.252782 0.289488 0.242130 0.227293 0.242354 0.222375 0.220077 0.220282 0.251648
chargesum: 0.00000
title: Mulliken charges with hydrogens summed into heavy atoms:
elementType: O O N C C C C C C C C C C C C C
charge: -0.267302 -0.271936 -0.235584 0.027195 -0.066680 0.046251 0.349937 0.262281 -0.284247 -0.049729 0.170193 0.324524 -0.140831 0.038987 0.148716 -0.051775
polarizability: 2.58180991e+02 1.31313018e+01 1.61779323e+02 1.01617029e+00 6.03038194e+00 8.50876321e+01
1716.lowfreq: -5.7741 -3.2456 -0.0001 0.0003 0.0007 9.7903 31.1908 52.8305 69.2386
frequency: 31.1166 52.8192 69.2314 91.3021 114.7863 157.8730 167.1628 208.5486 236.9076 245.9265 293.6004 306.5608 333.1998 341.1180 370.6455 411.8334 445.2950 470.1540 491.3830 521.0053 536.3769 567.8840 600.5310 627.8814 687.7512 712.9532 722.0110 766.4643 804.7620 819.3874 854.3804 879.3727 894.1298 931.2086 938.6035 958.7775 978.4637 993.4346 1009.4462 1039.4300 1060.1731 1079.6536 1107.8347 1112.5955 1126.9678 1147.9852 1169.7125 1184.3214 1195.8074 1213.4797 1254.1754 1264.1988 1282.9267 1290.7065 1328.9416 1333.5099 1355.2236 1376.4686 1384.4211 1405.8921 1431.5791 1441.1001 1456.0071 1465.8351 1466.2367 1473.5519 1474.4219 1493.8509 1549.3758 1580.1127 1625.9177 1635.5922 2958.0731 2966.7222 2973.7734 3002.5513 3036.0041 3044.9836 3066.3666 3099.0110 3107.7796 3122.6628 3132.9261 3141.3062 3159.3047 3203.8575 3217.0826
redmass: 3.6844 4.6592 3.4785 3.2399 2.7503 3.5428 3.2161 1.8796 2.0734 2.1608 4.9607 2.6782 2.9646 3.5254 5.8924 3.1936 2.9281 3.0634 3.6187 2.5882 4.5970 3.0875 4.0576 2.7444 3.5618 4.9993 3.5081 3.5330 1.5298 3.0514 1.5595 3.1352 1.5788 2.5226 1.3854 2.4307 1.4282 1.1586 4.0471 2.0329 1.6976 1.8813 3.0979 1.2601 2.2500 1.4166 1.3801 1.5153 1.5920 1.7940 1.9898 2.0678 1.7339 1.4362 1.9392 1.3853 1.4628 1.7644 3.3834 1.2990 1.9327 1.6899 1.1348 1.0500 1.1014 1.1119 1.0820 2.3335 9.3182 7.6014 5.9933 5.0158 1.0330 1.0657 1.0697 1.0615 1.0941 1.1039 1.1035 1.0608 1.0918 1.0993 1.0937 1.0915 1.0899 1.0938 1.1159
irintensity: 0.7267 7.3750 0.9925 2.6674 4.1954 5.3247 1.9138 0.2714 0.5599 0.4279 0.9042 4.4689 2.4713 1.4106 10.1396 3.0886 5.0954 0.9218 1.0595 10.0860 8.2029 2.7989 9.4647 9.8928 5.4312 5.2124 0.4144 16.4596 36.9975 7.4070 6.4382 5.0988 23.5601 11.5730 3.1662 25.9898 36.1170 36.5102 68.3003 10.2776 8.5665 2.8160 53.9495 0.2434 16.1166 6.2809 24.9201 68.4971 60.6709 60.5721 143.8712 62.5050 20.8523 6.3183 68.8073 11.2022 6.1337 3.2517 4.4927 95.5892 34.9994 2.3269 11.4813 13.1381 13.8956 2.0790 48.7635 172.1379 185.4345 16.4636 57.6771 24.5294 79.5245 22.2251 49.1938 30.4285 30.0607 50.0263 45.1177 7.9643 10.7140 28.6927 21.3763 7.7464 12.5706 2.2004 10.5981
temp: 298.150 k
press: 1.00000 atm
elementType: 8 8 7 6 6 6 6 6 6 6 6 6 6 6 6 6 1 1 1 1 1 1 1 1 1 1 1 1 1 1 1
symmnumber: 1
zpe: 662041.5 jmol-1
zpe.correction: 0.252158 hartree
zpe.thermalcorrener: 0.267009 hartree
zpe.thermalcorrenthalpy: 0.267953 hartree
zpe.thermalcorrgfe: 0.209701 hartree
zpe.sumelectzpe: -708.380643 hartree
zpe.sumelectthermal: -708.365792 hartree
zpe.sumelectthermalent: -708.364848 hartree
zpe.sumelectthermalfe: -708.423100 hartree
dipole: -0.4641 2.3252 1.5552
dipole: 2.8356
quadrupole: -77.8627 -88.9114 -97.4511
quadrupole: -13.7626 -3.1464 -1.8709
quadrupole: 10.2123 -0.8363 -9.3760 -13.7626 -3.1464 -1.8709
hfenergy: -708.632801 hartree
pointgroup: C01 [X(C13H15N1O2)]
dipole: -0.1432018 -0.9162069 -0.6202096 debye
polarizability: 259.1321654|-8.9154147|160.7119008|-1.41563|6.6732516|85.2038807 unknown
InChI: InChI=1S/C13H15NO2/c1-3-13(15)14-8-4-5-10-9-11(16-2)6-7-12(10)14/h3,6-7,9H,1,4-5,8H2,2H3
charge 0 multiplicity 1
31 atoms
O  4.198908 0.295945 0.033365
O  -2.046425 1.886488 0.662435
N  -1.468826 -0.230533 -0.203863
C  -1.241793 -2.631758 0.410321
C  0.265808 -2.625024 0.110837
C  -1.947096 -1.609327 -0.501478
C  0.815386 -1.205219 0.025636
C  -0.036342 -0.060941 -0.10129
C  2.212563 -1.023701 0.062373
C  0.5597 1.225958 -0.182747
C  -2.385759 0.804695 0.082835
C  2.794982 0.258942 -0.022332
C  1.956937 1.393265 -0.146503
C  -3.803346 0.60575 -0.378148
C  4.838052 1.610974 -0.043698
C  -4.799954 1.396442 0.098458
H  -1.671145 -3.63571 0.236169
H  -1.431902 -2.361887 1.465922
H  0.449527 -3.146218 -0.851366
H  0.819823 -3.192302 0.881315
H  -1.748499 -1.85606 -1.564563
H  -3.030526 -1.656047 -0.325339
H  2.875381 -1.890202 0.164469
H  -0.078047 2.106973 -0.251648
H  2.368994 2.404578 -0.208382
H  -4.018195 -0.129181 -1.162802
H  5.917651 1.410804 0.022921
H  4.526785 2.260883 0.797411
H  4.610792 2.115066 -1.003477
H  -5.828544 1.308698 -0.267351
H  -4.580492 2.154944 0.858523
