program: Gaussian 09
title: 000254821
version: EM64L-G09RevD.01
frameworkgroup: C1[X(C22H21NO2)]
method: RPBEPBE
basis: SDD
operation: Freq
keyword: #p
keyword: freq=noraman
keyword: PBEPBE/SDD
title: #p freq=noraman PBEPBE/SDD
converged: YES YES NO NO
title: Mulliken charges:
elementType: O O N C C C C C C C C C C C C C C C C C C C C C C H H H H H H H H H H H H H H H H H H H H H
charge: -0.496459 -0.337121 -0.374298 0.029889 -0.714163 0.391814 0.409723 0.458267 0.085804 -0.407394 -0.371944 -0.395759 -0.383394 -0.399720 -0.391390 -0.244684 -0.227788 -0.226863 -0.267091 -0.237124 0.176358 -0.249994 -0.247125 -0.243003 -0.615896 0.253973 0.219694 0.382041 0.244684 0.275179 0.293339 0.228216 0.263263 0.247197 0.220937 0.221612 0.220987 0.219781 0.233649 0.232428 0.222979 0.224038 0.328111 0.283824 0.232075 0.231345
chargesum: 0.00000
title: Mulliken charges with hydrogens summed into heavy atoms:
elementType: O O N C C C C C C C C C C C C C C C C C C C C C C
charge: -0.114418 -0.337121 -0.046187 0.029889 -0.240496 0.391814 0.409723 0.458267 0.085804 -0.162710 -0.096765 -0.102421 -0.155178 -0.136457 -0.144193 -0.023747 -0.006176 -0.005876 -0.047310 -0.003475 0.176358 -0.017566 -0.024146 -0.018965 0.131348
polarizability: 2.68881790e+02 -1.12877601e+01 2.82540005e+02 -1.58375020e+01 1.97918706e+00 1.84380070e+02
1716.lowfreq: -9.6146 -6.3198 -0.0003 0.0005 0.0007 3.5624 25.4806 31.1481 39.9291
frequency: 25.4414 31.0975 39.9126 47.8317 59.4964 63.8176 86.1800 92.2901 118.3429 126.1562 148.4898 155.3072 210.5711 212.0480 236.7524 258.2972 280.4114 291.4457 333.4727 339.4114 365.9724 391.3152 403.0331 404.8202 420.9497 447.5366 460.1701 504.2103 529.7330 539.2475 578.4488 603.5072 611.4007 616.0039 616.7880 644.4213 657.7489 694.6716 701.9809 704.5751 707.6414 757.2754 758.4825 778.9597 783.2578 793.4655 807.5074 828.5449 853.6270 857.5654 859.9572 888.0271 917.9501 922.1117 948.9449 960.0105 976.0510 980.6041 984.8861 989.5045 990.1873 992.6158 995.0195 997.3470 1002.4404 1027.6818 1029.5505 1033.7231 1049.3260 1077.7313 1091.7353 1106.4238 1122.0541 1138.4856 1158.0563 1161.3478 1168.7077 1169.5212 1178.6907 1183.1179 1185.6206 1191.6309 1210.2517 1224.1762 1284.0562 1297.2201 1308.7118 1309.3478 1316.6745 1377.6796 1379.2569 1381.0661 1416.3733 1426.0154 1430.4091 1432.8125 1440.1778 1456.7245 1467.1106 1477.4824 1478.6835 1482.0329 1486.2403 1523.8400 1564.7057 1585.4289 1587.9937 1589.7094 1606.6541 1609.6431 1610.9047 2984.8799 3008.6612 3066.4511 3069.3272 3111.4634 3115.2917 3116.6956 3117.7503 3120.8657 3124.3992 3126.7896 3133.5817 3137.2986 3139.6926 3147.4355 3154.1540 3154.7992 3165.0716 3167.2783 3177.8978 3557.6808
redmass: 4.8896 3.8858 4.0569 4.7381 4.6653 4.6421 1.1056 3.8538 4.5021 4.4637 4.9386 3.9040 5.0162 4.8977 4.6702 4.6855 4.8595 5.3424 5.4390 3.7944 5.8162 4.6938 2.8626 2.8788 2.8847 4.5056 3.2985 3.4021 4.1344 4.2052 5.4705 3.4271 1.1590 6.3488 6.3687 5.3598 5.4405 5.6069 3.0927 2.0106 1.7323 2.1910 1.8364 1.9261 2.0222 3.9834 1.2116 3.7405 1.2588 1.3361 2.1985 1.5045 1.6113 1.5357 2.3338 1.6073 1.3769 1.3952 2.6570 6.1547 5.1689 2.7912 1.4164 1.6103 1.3668 2.1402 2.2705 3.4331 2.2915 1.6003 1.7847 2.2612 1.2988 1.7189 2.5799 1.7674 1.0832 1.0804 1.1412 1.7707 1.1740 1.3798 2.3719 1.5074 2.0865 1.4831 1.3556 1.3563 1.3461 7.7556 7.4546 7.0965 1.2723 1.7831 2.0407 2.1249 1.4697 1.2784 1.2187 2.2117 2.1067 2.0432 1.0516 1.6860 5.6740 6.7649 6.1165 6.2574 6.0935 6.2036 6.0883 1.0350 1.0590 1.1025 1.1024 1.0716 1.0843 1.0842 1.0985 1.0868 1.0880 1.0878 1.0882 1.0939 1.0932 1.0940 1.0972 1.0990 1.1008 1.0977 1.0945 1.0778
irintensity: 0.8345 0.4945 0.0173 0.4135 2.8854 2.0515 0.2670 1.0073 1.3740 2.3569 2.5554 0.0221 2.5218 1.0610 1.1840 3.4506 1.7834 2.8737 8.8512 7.3373 23.4890 12.9641 0.0359 0.0586 3.4178 6.6468 7.0826 1.2192 1.9389 7.7281 13.3316 27.9570 95.5292 0.3594 1.2788 19.6906 9.0611 0.9590 12.9731 38.7607 90.2034 19.6254 26.8469 15.9015 90.7643 9.2550 250.3574 14.0452 4.0465 1.8272 4.1280 0.8448 16.4264 2.7961 9.1282 4.9376 0.1727 0.3473 14.0119 0.6648 0.0740 7.8819 0.6127 4.5175 2.2906 7.0937 13.1431 24.1600 10.2231 1.6549 6.2086 8.8466 0.4374 73.1842 5.0956 14.5906 0.6132 0.8466 3.7701 13.3952 2.8407 0.0490 1.6509 9.8462 90.3355 3.0043 24.7112 6.3559 1.4100 0.7950 0.9212 3.4730 45.5839 11.1921 7.1304 5.4737 69.6169 82.8369 16.9012 29.7041 3.4652 14.9472 14.9457 180.4940 150.0239 77.2214 2.9014 5.1437 9.3303 45.5805 1.7990 82.7872 20.0629 27.9317 12.9362 886.5296 2.0738 4.4000 3.7023 20.0219 9.4950 13.2776 2.4081 33.6830 48.5265 25.0451 30.8659 24.2697 24.0302 13.4162 6.7394 26.9528
temp: 298.150 k
press: 1.00000 atm
elementType: 8 8 7 6 6 6 6 6 6 6 6 6 6 6 6 6 6 6 6 6 6 6 6 6 6 1 1 1 1 1 1 1 1 1 1 1 1 1 1 1 1 1 1 1 1 1
symmnumber: 1
zpe: 975659.6 jmol-1
zpe.correction: 0.371609 hartree
zpe.thermalcorrener: 0.393561 hartree
zpe.thermalcorrenthalpy: 0.394505 hartree
zpe.thermalcorrgfe: 0.319162 hartree
zpe.sumelectzpe: -1054.396005 hartree
zpe.sumelectthermal: -1054.374053 hartree
zpe.sumelectthermalent: -1054.373109 hartree
zpe.sumelectthermalfe: -1054.448452 hartree
dipole: -5.2494 -0.0366 -3.0572
dipole: 6.0749
quadrupole: -118.0510 -134.1826 -144.5963
quadrupole: 4.6253 -1.3065 2.1586
quadrupole: 14.2257 -1.9060 -12.3197 4.6253 -1.3065 2.1586
hfenergy: -1054.7676141 hartree
pointgroup: C01 [X(C22H21N1O2)]
dipole: -2.0138698 -0.5939932 -1.1418245 debye
polarizability: 274.8103079|-13.8869281|275.6786914|-17.0708853|-5.3743798|185.3128662 unknown
InChI: InChI=1S/C22H21NO2/c1-23-21(24)20-15-9-8-10-17(20)16-22(25,18-11-4-2-5-12-18)19-13-6-3-7-14-19/h2-15,23,25H,16H2,1H3
charge 0 multiplicity 1
46 atoms
O  0.308312 -0.3919 1.453929
O  -1.348347 -2.437661 0.973409
N  -3.404882 -2.953236 0.04414
C  0.850449 -0.052764 0.143779
C  -0.212738 -0.398162 -0.97707
C  1.139979 1.465998 0.154677
C  2.164521 -0.84139 -0.093645
C  -1.60607 0.143962 -0.701212
C  -2.639578 -0.638086 -0.098754
C  1.875457 2.071822 -0.896007
C  2.992721 -1.102727 1.02836
C  0.649089 2.278272 1.203912
C  2.594317 -1.285784 -1.369695
C  -1.921022 1.471729 -1.088835
C  -3.927444 -0.074343 0.11723
C  2.100057 3.466153 -0.907035
C  4.21821 -1.785304 0.879434
C  0.880083 3.673383 1.198222
C  3.820707 -1.974419 -1.52106
C  -3.199244 2.027783 -0.872642
C  -2.400322 -2.057284 0.345768
C  -4.210432 1.253755 -0.259831
C  1.601181 4.275115 0.141681
C  4.639931 -2.224634 -0.39828
C  -3.363431 -4.362231 0.456021
H  -0.234309 -1.497854 -1.076518
H  0.144816 0.019853 -1.935036
H  -0.230342 -1.24824 1.376196
H  2.296384 1.453869 -1.698032
H  2.646485 -0.773848 2.013026
H  0.096463 1.794075 2.013178
H  1.977146 -1.112324 -2.258465
H  -1.140311 2.077617 -1.561234
H  -4.698029 -0.665518 0.626618
H  2.673571 3.918726 -1.724449
H  4.844157 -1.977475 1.758652
H  0.4962 4.289402 2.019947
H  4.133329 -2.314937 -2.515229
H  -3.402065 3.061015 -1.174648
H  -5.20118 1.680645 -0.070724
H  1.780642 5.35652 0.138045
H  5.590643 -2.757315 -0.515363
H  -4.181221 -2.625965 -0.532931
H  -2.439707 -4.513634 1.035783
H  -3.347802 -5.032978 -0.422159
H  -4.233771 -4.616786 1.088047
