program: Gaussian 09
title: 000254816
version: EM64L-G09RevD.01
frameworkgroup: C1[X(C15H14N2O)]
method: RPBEPBE
basis: SDD
operation: Freq
keyword: #p
keyword: freq=noraman
keyword: PBEPBE/SDD
title: #p freq=noraman PBEPBE/SDD
converged: YES YES NO NO
title: Mulliken charges:
elementType: O N N C C C C C C C C C C C C C C C H H H H H H H H H H H H H H
charge: -0.258254 -0.380382 -0.286797 0.301141 0.143542 -0.136189 0.370728 -0.385151 -0.395372 0.144432 -0.231588 -0.236752 -0.413952 -0.373016 -0.226027 -0.238465 -0.242494 -0.613171 0.277729 0.251754 0.234238 0.232461 0.249006 0.253616 0.226820 0.228969 0.313547 0.229304 0.230460 0.276300 0.230835 0.222726
chargesum: 0.00000
title: Mulliken charges with hydrogens summed into heavy atoms:
elementType: O N N C C C C C C C C C C C C C C C
charge: -0.258254 -0.066835 -0.056337 0.301141 0.143542 -0.136189 0.370728 -0.107421 -0.143618 0.144432 0.002649 -0.004291 -0.164946 -0.119400 0.000793 -0.009495 -0.013190 0.116690
polarizability: 2.24978093e+02 1.43470382e+01 1.66416952e+02 -1.52292397e+01 2.16702018e+01 1.32591897e+02
1716.lowfreq: -12.2614 -8.5582 -0.0007 -0.0002 0.0002 4.7793 18.9549 41.5518 56.9285
frequency: 17.2611 41.4054 56.8428 78.6860 96.7273 99.6071 111.2676 141.9793 187.6774 202.4694 244.7949 269.9549 295.5763 337.3205 371.5687 387.5422 402.0795 425.7657 459.1259 544.9227 569.4311 578.7758 613.7358 622.1631 648.6963 672.4735 699.1613 706.0043 720.4189 767.9742 780.4542 793.6875 811.3735 853.3834 878.8417 887.5410 904.0911 933.9745 965.1890 978.0587 988.7638 989.8633 996.5657 997.1934 1025.6762 1042.6387 1083.4899 1096.3650 1119.1522 1135.8437 1156.1611 1160.2747 1171.6107 1172.6280 1176.1700 1190.7141 1255.0559 1272.5539 1315.8067 1343.2345 1373.2949 1378.7213 1415.8266 1429.6422 1434.4654 1449.0861 1471.0360 1481.0855 1486.6200 1511.6740 1556.8921 1576.8526 1588.6076 1595.3877 1605.5884 1608.5446 2977.5693 3058.4792 3109.7427 3121.2794 3125.2410 3128.9005 3138.7084 3139.5250 3148.7238 3155.1026 3164.0947 3169.3756 3298.1000 3556.6978
redmass: 3.2747 4.1413 3.9643 3.2963 1.8063 2.5543 4.3169 4.2112 4.5429 4.6620 5.0045 4.9928 4.2111 5.7189 4.8476 4.5749 2.8225 3.8756 4.5266 4.1388 1.3552 2.6724 6.4200 5.2670 5.1495 5.1065 2.1384 2.8378 4.4352 1.8841 1.9872 2.5635 3.7975 1.2543 3.0025 1.2820 1.5024 1.4931 1.4442 1.4651 4.2594 4.4789 1.3508 1.3586 2.2878 2.2836 1.5872 2.4301 1.3063 1.6713 2.2557 2.4205 1.6655 1.0565 1.1145 1.1203 1.8431 1.8388 1.3741 2.1837 10.3618 8.2092 1.2171 2.1686 2.2894 1.3558 2.1101 2.2530 1.1167 1.5072 7.0531 6.7562 6.3446 7.1082 6.5613 6.0798 1.0353 1.1017 1.0983 1.0849 1.0862 1.0872 1.0899 1.0922 1.0966 1.0946 1.1015 1.0993 1.0750 1.0776
irintensity: 1.4043 1.6440 2.8907 2.7291 3.7680 0.4029 2.4305 1.3371 4.8867 2.5915 1.2602 1.7882 4.2500 14.6380 5.5449 6.2213 0.2034 2.5775 4.7107 2.2800 95.6265 33.4348 0.5488 26.8744 8.6218 0.3186 24.3240 66.6922 4.7219 37.9300 40.8215 26.6601 2.8649 2.1542 26.0629 21.7608 29.5844 1.9791 9.6818 1.9886 9.9102 3.6683 0.2168 1.0552 6.5645 4.7364 4.6505 1.8457 2.0779 42.3004 4.1559 24.2183 62.8060 0.4494 5.2919 4.7529 22.1944 63.2238 10.7737 99.9895 1.0999 5.9099 26.4116 11.3308 15.4177 73.5951 5.2933 4.3616 14.3278 134.2104 28.0116 27.2118 23.7785 50.3021 33.8239 4.6273 66.6673 34.5191 1.9376 2.4907 1.7219 0.6677 10.5982 16.7317 29.4970 18.0449 23.0677 19.6429 18.4790 18.4042
temp: 298.150 k
press: 1.00000 atm
elementType: 8 7 7 6 6 6 6 6 6 6 6 6 6 6 6 6 6 6 1 1 1 1 1 1 1 1 1 1 1 1 1 1
symmnumber: 1
zpe: 664541.3 jmol-1
zpe.correction: 0.253110 hartree
zpe.thermalcorrener: 0.269220 hartree
zpe.thermalcorrenthalpy: 0.270165 hartree
zpe.thermalcorrgfe: 0.207884 hartree
zpe.sumelectzpe: -763.457803 hartree
zpe.sumelectthermal: -763.441693 hartree
zpe.sumelectthermalent: -763.440749 hartree
zpe.sumelectthermalfe: -763.503029 hartree
dipole: 0.6203 2.9115 4.3857
dipole: 5.3006
quadrupole: -88.9632 -97.2700 -109.2957
quadrupole: -2.3397 -6.1142 3.7072
quadrupole: 9.5464 1.2397 -10.7861 -2.3397 -6.1142 3.7072
hfenergy: -763.7109135 hartree
pointgroup: C01 [X(C15H14N2O1)]
dipole: -0.3034354 0.0303384 -2.062989 debye
polarizability: 207.6955797|-41.0256764|151.9419741|-11.7062931|-20.3747353|164.3493881 unknown
InChI: InChI=1S/C15H14N2O/c1-17-15(18)13-10-6-5-9-12(13)14(16)11-7-3-2-4-8-11/h2-10,16-17H,1H3
charge 0 multiplicity 1
32 atoms
O  0.291593 1.981448 0.784258
N  0.556304 1.977415 -1.532874
N  -0.203243 -1.470014 2.562749
C  1.079825 -0.958052 0.595073
C  1.490933 0.120684 -0.243475
C  -0.222265 -0.964225 1.347928
C  -1.471624 -0.49314 0.656312
C  1.916857 -2.096256 0.708847
C  2.714645 0.024933 -0.955016
C  0.723993 1.422917 -0.271497
C  3.133148 -2.183479 -0.000499
C  3.532336 -1.120976 -0.842991
C  -1.723316 -0.830693 -0.699415
C  -2.454661 0.233997 1.378624
C  -2.942957 -0.467575 -1.313778
C  -3.666547 0.60568 0.762201
C  -3.918247 0.251717 -0.585754
C  -0.156586 3.242644 -1.738843
H  1.590098 -2.904402 1.370413
H  3.053222 0.874949 -1.558826
H  3.76558 -3.071627 0.105051
H  4.478826 -1.174727 -1.392029
H  -0.974466 -1.398482 -1.263674
H  -2.244631 0.544759 2.408222
H  -3.133853 -0.750575 -2.355381
H  -4.409639 1.181621 1.324923
H  0.832825 1.424667 -2.345577
H  -4.862784 0.537236 -1.062514
H  -1.155024 -1.49571 2.989766
H  -0.330938 3.688658 -0.746596
H  -1.136974 3.079232 -2.224933
H  0.441271 3.93998 -2.353295
