program: Gaussian 09
title: 000254813
version: EM64L-G09RevD.01
frameworkgroup: C1[X(C14H10N2O2)]
method: RPBEPBE
basis: SDD
operation: Freq
keyword: #p
keyword: freq=noraman
keyword: PBEPBE/SDD
title: #p freq=noraman PBEPBE/SDD
converged: YES YES NO NO
title: Mulliken charges:
elementType: O O N N C C C C C C C C C C C C C C H H H H H H H H H H
charge: -0.255617 -0.224807 -0.432559 -0.020832 -0.624892 0.401600 0.153839 0.284042 -0.341751 -0.011814 -0.262277 -0.329577 -0.333910 0.204060 -0.246827 -0.225573 -0.215543 -0.221478 0.274584 0.274153 0.404008 0.236427 0.262843 0.244162 0.284697 0.238114 0.242878 0.242049
chargesum: 0.00000
title: Mulliken charges with hydrogens summed into heavy atoms:
elementType: O O N N C C C C C C C C C C C C C C
charge: -0.255617 -0.224807 -0.028552 -0.020832 -0.076155 0.401600 0.153839 0.284042 -0.105323 -0.011814 0.000566 -0.085415 -0.049213 0.204060 -0.008713 0.017305 0.026506 -0.221478
polarizability: 2.99761598e+02 -1.35110985e+01 1.68596356e+02 -7.57164276e-02 5.33819979e-02 6.82234345e+01
1716.lowfreq: -1.7091 -0.0004 -0.0002 0.0005 6.3646 12.0012 15.8817 31.5508 64.4895
frequency: 15.2777 31.5449 64.4789 73.7829 85.7540 138.3996 148.7652 169.2813 181.0994 234.7885 250.9700 339.2021 390.8934 399.0513 399.8735 421.8388 434.4140 483.2597 515.6952 538.9603 552.5291 601.5961 613.1772 633.8045 652.2715 693.8337 704.5141 745.1388 759.4338 770.9700 804.8416 811.8300 857.7322 917.7262 956.5374 958.5717 972.5211 986.5707 989.6181 994.4276 1009.4762 1015.8884 1028.8897 1068.8826 1091.8605 1145.4172 1177.7642 1192.6193 1204.0274 1204.4303 1220.0897 1231.0256 1316.0093 1321.7279 1331.1161 1391.0774 1391.7311 1422.2856 1438.0743 1473.1484 1484.0399 1554.2213 1561.4059 1587.5767 1604.9884 1613.1376 1639.5081 2176.1827 2983.0573 3027.7455 3135.7410 3144.5433 3150.2331 3154.9195 3164.2296 3175.0461 3178.9922 3289.6481
redmass: 4.8195 5.9067 7.3020 6.8718 3.4570 8.5369 5.2140 8.5846 5.0012 4.9673 6.5496 8.4223 3.1887 2.8445 9.3285 3.7059 8.8060 8.6716 4.7132 6.4351 3.3136 7.6744 6.4538 4.2269 6.8590 1.8027 6.4567 5.6767 4.2130 1.9127 5.9045 1.3384 1.2526 1.8073 1.4603 1.3999 5.3290 1.3465 6.2082 1.3849 3.4027 1.3534 2.0076 4.8319 1.5985 1.6956 1.0693 1.1536 1.1421 1.4616 2.7949 5.1913 1.7948 1.7584 1.9071 4.0591 2.4060 1.1807 2.2516 3.3609 2.2308 6.5685 6.5970 5.1389 5.1736 5.9176 6.6254 12.6249 1.0612 1.0963 1.0855 1.0881 1.0908 1.0924 1.0964 1.1014 1.0959 1.0800
irintensity: 0.5896 0.5741 3.4231 1.0968 3.7919 1.1178 0.6036 3.2117 0.2287 6.4312 0.1631 22.5929 2.1512 0.2227 0.2214 0.1298 1.3688 9.3501 3.8910 6.4221 2.4400 5.0522 0.4772 11.7789 24.1303 54.4064 23.6860 0.4953 0.1481 45.0730 5.8912 53.3770 0.4789 0.5184 20.3621 4.5555 37.4946 81.0281 9.8045 0.6655 89.7179 0.0058 5.4669 6.6491 9.7163 17.3478 9.6014 64.8572 6.9838 49.8798 264.6817 2.6214 4.6141 0.3581 27.5684 18.9065 67.1824 44.5015 24.2117 3.1405 6.3583 227.7516 181.3087 108.9414 35.3623 51.8386 403.6149 37.3518 15.4642 0.7085 0.7061 5.0341 8.6214 14.5470 13.0993 20.8870 4.1540 608.0915
temp: 298.150 k
press: 1.00000 atm
elementType: 8 8 7 7 6 6 6 6 6 6 6 6 6 6 6 6 6 6 1 1 1 1 1 1 1 1 1 1
symmnumber: 1
zpe: 541882.8 jmol-1
zpe.correction: 0.206392 hartree
zpe.thermalcorrener: 0.221541 hartree
zpe.thermalcorrenthalpy: 0.222485 hartree
zpe.thermalcorrgfe: 0.161608 hartree
zpe.sumelectzpe: -798.202137 hartree
zpe.sumelectthermal: -798.186989 hartree
zpe.sumelectthermalent: -798.186045 hartree
zpe.sumelectthermalfe: -798.246922 hartree
dipole: -12.0990 6.5421 0.0084
dipole: 13.7544
quadrupole: -131.9471 -100.7180 -106.1617
quadrupole: 14.0014 -0.0233 0.0551
quadrupole: -19.0049 12.2243 6.7806 14.0014 -0.0233 0.0551
hfenergy: -798.4085295 hartree
pointgroup: C01 [X(C14H10N2O2)]
dipole: -4.800194 -0.4318884 -2.4606966 debye
polarizability: 300.0926485|-1.5950961|72.4484293|11.976179|19.9469047|164.0403104 unknown
InChI: InChI=1S/C14H10N2O2/c15-9-11-6-7-12(16-14(11)18)8-13(17)10-4-2-1-3-5-10/h1-7,16H,8H2
charge 0 multiplicity 1
28 atoms
O  -0.97075 0.311904 1.579831
O  3.311088 0.35834 2.085752
N  1.520366 0.075116 0.610367
N  6.385037 -0.142218 0.043742
C  -0.555631 -0.183157 -0.789365
C  0.958897 -0.179146 -0.617054
C  -1.455289 0.081306 0.427068
C  -2.935938 0.063184 0.2217
C  1.79567 -0.431628 -1.70893
C  2.92318 0.112071 0.908608
C  3.205717 -0.417895 -1.519365
C  -3.537779 -0.186358 -1.043486
C  -3.767599 0.308396 1.350235
C  3.774135 -0.157583 -0.264364
C  -4.941543 -0.189837 -1.173848
C  -5.16874 0.304236 1.217458
C  -5.759439 0.055037 -0.045359
C  5.195463 -0.147023 -0.086816
H  -0.815403 0.56346 -1.566439
H  -0.849818 -1.161067 -1.219739
H  0.867382 0.254331 1.397924
H  1.364711 -0.635623 -2.691752
H  3.867254 -0.6146 -2.369595
H  -2.924272 -0.378154 -1.929979
H  -3.287578 0.498431 2.315595
H  -5.399244 -0.382234 -2.149806
H  -5.801458 0.493698 2.090695
H  -6.849919 0.051717 -0.149684
