program: Gaussian 09
title: 000254803
version: EM64L-G09RevD.01
frameworkgroup: C1[X(C11H13NO2)]
method: RPBEPBE
basis: SDD
operation: Freq
keyword: #p
keyword: freq=noraman
keyword: PBEPBE/SDD
title: #p freq=noraman PBEPBE/SDD
converged: YES YES NO NO
title: Mulliken charges:
elementType: O O N C C C C C C C C C C C H H H H H H H H H H H H H
charge: -0.177042 -0.180752 -0.416167 -0.545822 -0.581968 0.489259 0.284150 -0.412605 -0.412689 -0.227675 -0.227637 -0.242219 0.247849 -0.795977 0.237668 0.237269 0.252975 0.252418 0.234257 0.234321 0.225404 0.225420 0.322399 0.228767 0.238230 0.238167 0.272000
chargesum: 0.00000
title: Mulliken charges with hydrogens summed into heavy atoms:
elementType: O O N C C C C C C C C C C C
charge: -0.177042 -0.180752 -0.093768 -0.070885 -0.076575 0.489259 0.284150 -0.178349 -0.178368 -0.002271 -0.002217 -0.013451 0.247849 -0.047580
polarizability: 1.75399796e+02 1.52573354e+01 1.02383514e+02 3.38026058e-01 -3.13194752e-01 1.08411968e+02
1716.lowfreq: -34.6147 -5.7017 -0.0006 -0.0005 0.0004 2.0972 7.1955 11.7041 24.2469
frequency: -27.4278 7.6169 24.0078 32.7358 53.6187 65.7767 125.3702 128.8413 212.8031 231.9576 324.8471 336.7897 377.4849 403.3663 495.7958 528.1622 534.1594 564.6737 594.9713 618.1601 676.7949 698.2874 709.2542 759.1360 782.8045 818.5270 854.1074 878.8307 893.8399 922.9457 976.1408 989.7322 992.3208 994.0975 999.7219 1026.5063 1033.1814 1056.6285 1082.6544 1131.3098 1140.3982 1172.1659 1186.5359 1201.8174 1217.0545 1270.1654 1271.6087 1326.6528 1342.6424 1376.4042 1382.0344 1418.4238 1440.1702 1440.3322 1458.1862 1467.1901 1471.0670 1484.4920 1593.0594 1615.0950 1652.1585 1685.9502 2967.7644 2987.8306 3014.0766 3017.4588 3073.4563 3074.8443 3114.2347 3114.5237 3131.5525 3136.8247 3143.6896 3162.3706 3507.1817
redmass: 2.7652 3.8127 1.1259 4.3362 4.6270 4.1670 3.2870 5.8623 5.4192 6.3927 2.4014 4.0616 4.4714 2.8194 4.3672 3.5023 2.5280 4.9960 2.6684 6.3207 1.1273 3.8020 1.9267 2.0264 1.4042 3.8010 1.2473 4.4380 2.8111 1.5838 1.3888 5.9653 1.8636 1.3411 2.3875 2.2230 1.7110 3.9501 1.5648 2.5514 1.1694 1.0516 1.1146 2.9708 2.2889 1.5387 1.2432 1.2532 1.5947 1.2340 7.9803 1.6070 2.1559 1.1016 1.1508 1.0470 1.1051 2.3173 6.0555 6.1997 4.6718 10.0480 1.0591 1.0382 1.0603 1.0993 1.0982 1.1033 1.0882 1.0862 1.0905 1.0983 1.0957 1.1015 1.0769
irintensity: 0.9672 1.2405 0.7951 8.3252 2.5174 0.3868 0.0230 3.9596 0.9862 3.4109 0.4094 0.5714 2.3238 0.0006 34.0782 4.0759 0.0100 4.0879 2.6934 0.0361 80.4107 6.3049 52.3366 38.9100 7.2810 2.6526 0.1035 4.5072 15.1089 11.7478 0.0079 0.3766 4.2131 0.5826 5.8049 4.6921 9.2495 11.8102 6.1008 162.2676 2.9674 0.1181 0.8031 200.0471 0.0818 39.8503 8.4235 0.2138 11.8661 68.1082 0.1484 552.9847 7.9620 65.1767 108.8617 21.0392 15.3508 19.2300 1.3900 11.1844 5.4931 270.7988 16.5205 6.1741 14.2531 6.1196 11.9365 16.7354 5.8919 12.2502 9.4174 8.5040 43.6122 23.1554 8.6951
temp: 298.150 k
press: 1.00000 atm
elementType: 8 8 7 6 6 6 6 6 6 6 6 6 6 6 1 1 1 1 1 1 1 1 1 1 1 1 1
symmnumber: 1
zpe: 568210.5 jmol-1
zpe.correction: 0.216420 hartree
zpe.thermalcorrener: 0.229880 hartree
zpe.thermalcorrenthalpy: 0.230824 hartree
zpe.thermalcorrgfe: 0.171592 hartree
zpe.sumelectzpe: -631.156247 hartree
zpe.sumelectthermal: -631.142786 hartree
zpe.sumelectthermalent: -631.141842 hartree
zpe.sumelectthermalfe: -631.201074 hartree
dipole: 2.1649 6.1223 0.0799
dipole: 6.4943
quadrupole: -89.7703 -87.4492 -76.2074
quadrupole: -17.7001 -0.1894 -0.1909
quadrupole: -5.2946 -2.9736 8.2682 -17.7001 -0.1894 -0.1909
hfenergy: -631.3726667 hartree
pointgroup: C01 [X(C11H13N1O2)]
dipole: 0.8767178 -2.3999464 -0.0005386 debye
polarizability: 175.7091505|-14.4983481|102.0677429|-0.0302031|-0.2669643|108.4183842 unknown
InChI: InChI=1S/C11H13NO2/c1-9(13)12-11(14)8-7-10-5-3-2-4-6-10/h2-6,12H,7-8H2,1H3
charge 0 multiplicity 1
27 atoms
O  -2.084636 1.698797 -0.007706
O  -4.825244 0.68965 -0.011034
N  -2.81249 -0.548389 -0.010553
C  0.683142 1.018177 0.002338
C  -0.393298 -0.094245 -0.008855
C  2.087431 0.431861 0.003296
C  -1.822227 0.474874 -0.009762
C  2.746505 0.126949 1.222562
C  2.755234 0.143205 -1.215182
C  4.034571 -0.45455 1.226274
C  4.043298 -0.438333 -1.217361
C  4.687348 -0.741109 0.004815
C  -4.231093 -0.411241 -0.010624
C  -4.951297 -1.761785 -0.009235
H  0.52747 1.6673 -0.877807
H  0.52143 1.65528 0.890159
H  -0.256055 -0.740294 -0.900055
H  -0.261702 -0.752927 0.873936
H  2.251329 0.358263 2.174336
H  2.266923 0.3872 -2.167335
H  4.531039 -0.676459 2.177839
H  4.546553 -0.647665 -2.168213
H  -2.457397 -1.509457 -0.010484
H  5.688128 -1.187254 0.005422
H  -4.688339 -2.354729 0.886628
H  -4.688305 -2.356736 -0.903752
H  -6.03582 -1.582481 -0.009443
