program: Gaussian 09
title: 000254767
version: EM64L-G09RevD.01
frameworkgroup: C1[X(C13H14O4)]
method: RPBEPBE
basis: SDD
operation: Freq
keyword: #pfreq=noraman
keyword: PBEPBE/SDD
title: #p freq=noraman PBEPBE/SDD
converged: YES YES NO NO
title: Mulliken charges:
elementType: O O O O C C C C C C C C C C C C C H H H H H H H H H H H H H H
charge: -0.285715 -0.261479 -0.222640 -0.251241 -0.078047 -0.707464 0.272855 0.217047 0.220803 -0.340094 -0.334812 -0.220148 -0.217368 -0.370780 -0.221639 -0.029365 -0.548678 0.263748 0.238791 0.238520 0.234811 0.269110 0.269283 0.233552 0.231316 0.244806 0.225060 0.232339 0.254416 0.223579 0.219435
chargesum: 0.00000
title: Mulliken charges with hydrogens summed into heavy atoms:
elementType: O O O O C C C C C C C C C C C C C
charge: -0.285715 -0.261479 -0.222640 -0.251241 0.185702 0.004658 0.272855 0.217047 0.220803 -0.070985 -0.065530 0.013404 0.013948 0.099087 0.010700 0.225052 -0.105665
polarizability: 2.28795531e+02 1.03426605e+01 1.28478437e+02 -1.99052446e+01 1.73526121e+01 1.07453455e+02
1716.lowfreq: -9.3008 -4.9130 -3.9185 -0.0008 -0.0008 -0.0008 11.7926 27.3835 35.3242
frequency: 10.9324 27.1921 35.2453 53.5022 57.4659 90.0958 102.1524 108.3138 153.4894 197.3889 206.2643 220.9180 261.0403 287.8200 308.4094 330.9140 377.7536 398.8555 403.2269 440.7960 454.5100 524.0557 613.7531 625.2059 660.9427 672.8193 680.7241 697.3381 702.2608 792.7323 795.6812 797.2731 858.0382 864.3878 906.4465 929.5015 954.6567 963.5952 968.0166 990.6153 995.7137 1008.6585 1016.0002 1018.9580 1030.8681 1050.7874 1076.6469 1087.5642 1110.8514 1144.8295 1160.5686 1174.1528 1184.1990 1240.0879 1248.6459 1285.6377 1288.6197 1316.6243 1323.9758 1343.8272 1390.0802 1390.6744 1427.3866 1438.1711 1449.8488 1466.2358 1476.6871 1478.9311 1585.5307 1611.9313 1625.3348 1656.7165 1659.6485 3004.4523 3024.0374 3044.1511 3090.9102 3109.6563 3113.1757 3113.6351 3130.1500 3132.2062 3143.1724 3155.5019 3167.6888 3181.2645 3201.4823
redmass: 4.7610 4.6539 4.1785 5.0849 4.3216 8.5369 3.4203 3.0030 4.9946 5.0537 2.2215 1.3535 3.2037 5.8055 5.1644 3.6760 3.3702 3.9996 2.8220 3.5957 3.4206 3.3568 6.4347 4.3232 4.0684 2.8430 4.9414 3.3669 1.8058 3.3278 2.9400 3.7417 4.2392 1.2451 2.9370 1.5821 1.4222 1.4218 1.9622 6.2265 1.3871 1.3302 1.7030 1.7332 1.9466 3.1977 2.3461 1.6989 3.0915 2.3424 2.0827 1.0569 1.1262 2.6277 1.1506 1.2409 1.7352 1.3195 1.3504 1.2674 2.5317 1.8852 1.1567 2.2470 1.1342 1.0463 1.1951 1.8210 6.6959 6.1198 10.7804 10.3954 4.5953 1.0349 1.0608 1.0847 1.0611 1.1010 1.1013 1.1005 1.0856 1.0978 1.0892 1.0941 1.0984 1.0971 1.1143
irintensity: 1.0475 0.4104 0.8311 2.3011 0.6677 0.7934 1.1969 0.5344 0.2099 2.6723 2.6698 1.1913 6.8573 1.1459 5.2787 7.7313 29.1431 0.8475 0.0073 1.5331 2.7851 1.2213 0.6326 11.5160 6.6849 6.6230 22.7630 13.5364 88.7715 0.5165 19.3353 13.7270 14.2104 0.0428 28.8961 47.1295 3.3939 62.6725 19.1742 3.3532 0.0349 0.3131 104.5531 45.9932 17.1933 320.0211 353.3222 8.2047 69.2598 116.7358 2.1994 0.1195 22.6970 239.9525 5.2144 2.5206 30.4286 2.6763 27.5593 3.8057 14.3258 4.5863 13.6850 17.3470 18.4517 15.5185 19.7207 3.1329 35.4028 9.9123 203.3741 131.0109 2.5422 13.1088 23.8943 4.0506 8.3865 18.9104 7.2650 15.3619 0.3103 6.9784 11.4214 17.0744 22.2802 7.2674 20.9173
temp: 298.150 k
press: 1.00000 atm
elementType: 8 8 8 8 6 6 6 6 6 6 6 6 6 6 6 6 6 1 1 1 1 1 1 1 1 1 1 1 1 1 1
symmnumber: 1
zpe: 633423.9 jmol-1
zpe.correction: 0.241258 hartree
zpe.thermalcorrener: 0.258315 hartree
zpe.thermalcorrenthalpy: 0.259259 hartree
zpe.thermalcorrgfe: 0.192894 hartree
zpe.sumelectzpe: -803.411445 hartree
zpe.sumelectthermal: -803.394388 hartree
zpe.sumelectthermalent: -803.393444 hartree
zpe.sumelectthermalfe: -803.459809 hartree
dipole: 0.5642 1.7484 0.1427
dipole: 1.8427
quadrupole: -70.5061 -94.7478 -102.0233
quadrupole: 0.5237 -3.8467 1.8762
quadrupole: 18.5863 -5.6554 -12.9309 0.5237 -3.8467 1.8762
hfenergy: -803.6527029 hartree
pointgroup: C01[X(C13H14O4)]
dipole: 0.227376 -0.6826029 0.0890684 debye
polarizability: 228.6726355|-5.2366252|134.5261435|22.1558744|11.7435232|101.5286444 unknown
InChI: InChI=1S/C13H14O4/c1-3-9-16-12(14)10(2)17-13(15)11-7-5-4-6-8-11/h3-8,10H,1,9H2,2H3
charge 0 multiplicity 1
31 atoms
O  -0.356936 -0.857618 0.649207
O  3.081803 0.391894 0.738943
O  1.572231 0.332745 -1.045149
O  -0.626373 1.394557 1.190304
C  1.036981 -0.764023 1.131794
C  1.550035 -2.20304 1.272461
C  1.878158 0.046378 0.129561
C  -2.476227 0.166841 0.168443
C  -1.100571 0.336231 0.709844
C  -3.350201 1.284466 0.214421
C  -2.922613 -1.060816 -0.386442
C  -4.662254 1.173869 -0.288214
C  -4.236743 -1.165906 -0.88828
C  4.046534 1.186012 -0.106126
C  -5.108044 -0.051538 -0.839618
C  4.844015 0.287683 -1.015186
C  6.183903 0.110535 -0.904764
H  1.054787 -0.227754 2.097353
H  2.593029 -2.193621 1.630431
H  0.926743 -2.751124 1.998413
H  1.506714 -2.728039 0.303129
H  -2.980973 2.222311 0.642446
H  -2.23704 -1.91162 -0.422556
H  -5.335698 2.036903 -0.252978
H  -4.582018 -2.112149 -1.318644
H  3.452356 1.917085 -0.684143
H  4.679913 1.69567 0.635661
H  -6.128065 -0.136721 -1.23107
H  4.277475 -0.21452 -1.810242
H  6.73692 -0.529711 -1.600766
H  6.768361 0.606419 -0.119336
