program: Gaussian 09
title: 000254730
version: EM64L-G09RevD.01
frameworkgroup: C1[X(C22H22N4O2)]
method: RPBEPBE
basis: SDD
operation: Freq
keyword: #p
keyword: freq=noraman
keyword: PBEPBE/SDD
title: #p freq=noraman PBEPBE/SDD
converged: YES YES NO NO
title: Mulliken charges:
elementType: O O N N N N C C C C C C C C C C C C C C C C C C C C C C H H H H H H H H H H H H H H H H H H H H H H
charge: -0.240978 -0.240933 -0.275382 -0.275470 -0.022422 -0.022537 -0.383973 -0.384365 0.248548 0.248847 0.154730 0.155008 -0.790370 -0.790530 0.412515 0.412386 -0.344525 -0.344507 -0.395271 -0.395364 -0.424592 -0.425188 -0.340173 -0.339622 0.457707 0.457793 -0.811048 -0.811065 0.277619 0.277919 0.280777 0.254660 0.222867 0.222851 0.280930 0.254637 0.296472 0.296479 0.279233 0.279229 0.230149 0.230149 0.229187 0.229166 0.231725 0.227859 0.224647 0.228317 0.224683 0.231228
chargesum: 0.00000
title: Mulliken charges with hydrogens summed into heavy atoms:
elementType: O O N N N N C C C C C C C C C C C C C C C C C C C C C C
charge: -0.240978 -0.240933 -0.275382 -0.275470 -0.022422 -0.022537 -0.106354 -0.106446 0.248548 0.248847 0.154730 0.155008 -0.032066 -0.032112 0.412515 0.412386 -0.048053 -0.048028 -0.116038 -0.116135 -0.194443 -0.195039 -0.110986 -0.110455 0.457707 0.457793 -0.126817 -0.126838
polarizability: 3.15576354e+02 2.75858482e-02 2.89608724e+02 2.22650839e+01 7.27787887e-02 2.46540838e+02
1716.lowfreq: -18.7017 -15.6582 -0.0007 -0.0003 0.0003 2.8767 5.5716 5.9533 12.9171
frequency: -18.6522 -15.3903 12.9007 32.0450 32.6631 47.6003 56.6409 74.7918 78.0137 99.3261 104.1866 137.5598 145.3438 146.8591 147.7495 174.2608 174.4202 180.7576 261.3480 268.7254 285.5533 288.1961 297.9944 304.7842 327.2318 350.7257 356.1044 381.5335 382.5265 389.1658 400.0216 412.0012 412.1761 479.5744 514.0399 516.4320 558.0824 563.3003 563.5944 574.1583 596.6207 606.6944 610.9245 636.2049 637.1057 667.8888 722.0083 722.1253 747.9952 754.0993 784.4490 786.5108 836.1867 836.7272 837.3539 852.5052 852.6768 856.3505 898.0224 933.5891 936.8872 970.5820 971.0047 983.5619 983.6876 986.4568 986.5030 992.7673 993.0773 1012.5035 1013.5670 1030.7682 1043.3738 1047.8686 1047.9381 1051.0662 1051.5009 1085.8358 1130.1846 1130.5744 1136.2066 1154.5773 1163.5337 1190.8171 1195.7823 1195.8980 1209.5461 1222.6631 1223.1160 1282.9499 1292.1452 1305.8373 1313.5484 1313.8443 1361.2655 1366.8022 1373.0511 1373.7880 1397.8402 1398.0096 1398.9002 1399.5249 1419.0094 1419.1943 1446.9555 1447.2743 1467.7558 1468.1917 1470.0923 1470.1523 1475.9250 1476.0510 1508.3731 1509.9792 1574.7491 1574.7848 1590.8641 1591.5357 1617.0129 1622.5154 1625.6157 1625.8528 2971.1438 2974.2087 2974.3200 2977.8591 2979.6639 2981.2671 3051.5331 3051.5530 3059.9934 3060.1386 3082.5291 3082.6141 3108.9369 3109.0494 3123.8787 3123.9277 3129.5378 3129.6025 3186.2639 3186.2741 3188.1944 3188.2005
redmass: 1.0276 1.0319 5.2004 3.9614 4.2231 5.2089 5.3112 4.5275 5.9911 4.2301 6.3386 4.2384 1.5511 1.2946 2.3863 2.5182 3.5160 2.4998 3.9948 5.0666 4.2047 4.1731 5.0351 4.2042 6.2504 5.4548 4.4898 3.7222 3.9475 4.2025 4.8843 2.9768 3.0067 6.2801 2.8336 2.8434 4.9948 5.2740 4.5137 5.0066 5.5246 4.8828 5.4441 6.9538 6.8112 7.6235 3.2247 3.2311 6.9623 7.3502 5.0432 5.1302 1.5009 1.4505 5.8787 1.2443 1.2463 4.9522 3.6100 2.6523 4.8175 1.3166 1.3165 1.5732 1.5802 1.3525 1.3522 2.0382 2.0983 2.5885 2.6141 1.4532 2.5259 1.5483 1.5484 4.0156 2.1933 2.7413 1.3121 1.2795 2.7987 1.4003 1.4455 1.3515 1.5089 1.1584 3.3328 2.8275 3.0509 1.5200 4.9344 4.6953 1.3022 1.3310 3.3905 3.6385 5.7166 5.0455 1.3039 1.2853 1.4594 1.4991 3.2522 3.2440 1.0878 1.0882 1.0688 1.0695 1.0460 1.0462 1.1108 1.1109 2.8167 2.8291 6.0610 6.2393 6.8425 6.7770 11.2356 11.3659 6.4694 6.2987 1.0785 1.0373 1.0373 1.0607 1.0384 1.0579 1.0975 1.0975 1.0977 1.0977 1.0986 1.0986 1.0981 1.0981 1.0905 1.0905 1.0908 1.0908 1.0935 1.0935 1.0947 1.0947
irintensity: 0.3502 0.3500 0.0786 0.1403 0.7471 2.2878 0.7602 1.8484 2.0503 0.0770 0.4872 0.0324 4.1466 0.4378 2.5321 0.8436 0.2403 0.0684 1.0825 0.4996 1.8023 6.6188 2.6070 1.5051 13.3036 1.8629 12.1791 3.5483 2.9886 0.7852 0.0980 0.1563 0.0616 0.5051 16.5537 24.8522 18.5588 34.7629 2.7996 0.3699 0.1391 6.6064 8.5110 0.0044 0.1114 2.5411 1.4145 0.6512 19.2232 7.7991 0.5975 0.0435 67.2551 51.7019 14.0046 0.5949 0.7267 1.0200 21.4027 11.2565 12.2174 8.0069 6.4693 1.9208 2.7767 0.2206 0.4169 11.8484 5.7475 5.9581 9.0870 13.8500 8.5221 9.9138 12.8562 34.3816 9.8678 0.2430 25.4574 0.5575 32.3979 0.8414 16.9758 5.5625 2.5137 8.9569 0.4697 2.8816 0.1745 37.3334 192.7852 34.7670 4.2003 0.5506 93.6540 16.7282 2.5767 3.2336 2.1011 8.4420 46.3065 45.4975 4.3485 1.4538 0.2498 19.6720 11.8902 15.3686 13.0397 11.1945 15.1175 17.6061 194.2806 172.2149 4.3570 1.5731 13.3712 9.7388 6.8805 454.8882 12.1182 6.3171 7.3274 47.1327 49.4896 5.7235 7.9641 31.4257 28.4019 15.4159 4.5923 14.8242 17.6651 19.5786 17.2359 0.3667 27.4852 20.7923 21.1591 18.3965 1.4393 1.2355 4.1394 1.7830
temp: 298.150 k
press: 1.00000 atm
elementType: 8 8 7 7 7 7 6 6 6 6 6 6 6 6 6 6 6 6 6 6 6 6 6 6 6 6 6 6 1 1 1 1 1 1 1 1 1 1 1 1 1 1 1 1 1 1 1 1 1 1
symmnumber: 1
zpe: 1032080.3 jmol-1
zpe.correction: 0.393099 hartree
zpe.thermalcorrener: 0.417697 hartree
zpe.thermalcorrenthalpy: 0.418642 hartree
zpe.thermalcorrgfe: 0.337075 hartree
zpe.sumelectzpe: -1218.995126 hartree
zpe.sumelectthermal: -1218.970527 hartree
zpe.sumelectthermalent: -1218.969583 hartree
zpe.sumelectthermalfe: -1219.051150 hartree
dipole: -0.0062 -2.9642 0.0043
dipole: 2.9642
quadrupole: -153.8506 -134.9401 -164.0169
quadrupole: 0.0195 4.2265 -0.0063
quadrupole: -2.9148 15.9958 -13.0810 0.0195 4.2265 -0.0063
hfenergy: -1219.3882246 hartree
pointgroup: C01 [X(C22H22N4O2)]
dipole: 0.0029145 1.1662007 0.0013262 debye
polarizability: 318.1626807|0.0100926|289.6086333|-17.6210032|-0.082719|243.9546024 unknown
InChI: InChI=1S/C22H22N4O2/c1-13-5-9-17(10-6-13)25-21(27)19(15(3)23-25)20-16(4)24-26(22(20)28)18-11-7-14(2)8-12-18/h5-12,19-20H,1-4H3
charge 0 multiplicity 1
50 atoms
O  -1.084456 0.863034 -1.992446
O  1.081735 0.858986 1.990543
N  -2.37709 0.703426 0.019681
N  2.374524 0.699112 -0.021381
N  -2.431666 1.371888 1.296864
N  2.430187 1.368246 -1.298158
C  -0.774491 2.410852 -0.033292
C  0.773986 2.408338 0.032295
C  -1.511674 2.317563 1.294778
C  1.510804 2.314514 -1.295927
C  -1.391103 1.235225 -0.824598
C  1.386616 1.22932 0.821642
C  -1.271684 3.18218 2.492572
C  1.271873 3.179961 -2.493335
C  -3.283679 -0.378116 -0.213422
C  3.282163 -0.38135 0.212655
C  -3.259771 -1.095728 -1.436479
C  3.256453 -1.100341 1.434844
C  -4.219204 -0.728547 0.793951
C  4.220239 -0.72961 -0.793118
C  -4.174454 -2.15218 -1.634564
C  4.171992 -2.155927 1.633762
C  -5.119529 -1.786876 0.570101
C  5.12137 -1.787048 -0.568451
C  -5.118847 -2.521375 -0.645256
C  5.119207 -2.522646 0.646262
C  -6.092594 -3.665673 -0.86697
C  6.095805 -3.664158 0.869773
H  -1.080188 3.34803 -0.545012
H  1.082691 3.343834 0.545321
H  -0.278241 2.95372 2.921435
H  -2.033872 2.983035 3.262707
H  -1.296729 4.256907 2.231142
H  1.298046 4.254538 -2.231408
H  0.278224 2.952776 -2.922409
H  2.03392 2.980353 -3.26349
H  -2.537852 -0.829775 -2.211245
H  2.532289 -0.836356 2.208186
H  -4.225346 -0.17106 1.732817
H  4.2274 -0.171415 -1.731556
H  -4.146772 -2.701337 -2.583394
H  4.142654 -2.70638 2.581788
H  -5.837691 -2.048495 1.357104
H  5.841321 -2.047196 -1.35431
H  -5.91011 -4.492857 -0.154567
H  -7.139646 -3.33904 -0.722896
H  -6.00546 -4.077958 -1.886943
H  7.143661 -3.326797 0.759121
H  5.986472 -4.097135 1.878971
H  5.93822 -4.478064 0.136616
