program: Gaussian 09
title: 000254729
version: EM64L-G09RevD.01
frameworkgroup: C1[X(C15H21NO2)]
method: RPBEPBE
basis: SDD
operation: Freq
keyword: #p
keyword: freq=noraman
keyword: PBEPBE/SDD
title: #p freq=noraman PBEPBE/SDD
converged: NO YES NO NO
title: Mulliken charges:
elementType: O O N C C C C C C C C C C C C C C C H H H H H H H H H H H H H H H H H H H H H
charge: -0.204336 -0.208181 -0.165518 -0.261483 -0.263071 -0.243323 -0.241470 -0.531727 -0.219968 -0.220951 0.111013 0.124047 -0.432845 0.026932 -0.402847 -0.401844 -0.709478 -0.725181 0.284622 0.286425 0.275064 0.275058 0.235570 0.259102 0.247005 0.247189 0.242575 0.242402 0.232911 0.204297 0.202796 0.198611 0.202131 0.213386 0.219985 0.215463 0.254877 0.211824 0.218937
chargesum: 0.00000
title: Mulliken charges with hydrogens summed into heavy atoms:
elementType: O O N C C C C C C C C C C C C C C C
charge: -0.204336 -0.208181 -0.165518 0.023139 0.023353 0.031740 0.033588 -0.037056 0.027037 0.026239 0.111013 0.124047 0.052133 0.259844 0.004246 -0.001101 -0.060644 -0.039544
polarizability: 1.95923443e+02 3.57414954e+00 1.65938855e+02 -6.72379133e+00 6.91241750e+00 1.26499455e+02
1716.lowfreq: -15.6650 -5.3940 -0.0007 -0.0003 0.0007 9.9180 23.7960 45.5612 52.1476
frequency: 22.8395 45.5237 51.8974 80.6161 87.7240 104.7342 123.4269 166.5533 170.1856 205.3235 215.7122 232.8579 268.4747 292.3405 309.7654 319.5668 356.2755 383.6126 420.2999 470.9171 509.3487 512.6215 539.6375 596.7750 618.7401 621.0543 677.7031 720.2757 754.1264 757.6478 775.2239 782.8663 790.5120 802.6731 804.8220 880.5079 885.7733 898.8820 900.3804 915.0037 925.2789 939.8165 948.7347 953.5468 999.1441 999.7658 1017.0796 1018.1483 1021.2709 1047.0751 1048.7326 1067.9115 1089.6605 1097.8691 1119.6345 1134.3023 1148.0411 1151.5623 1153.7477 1177.6682 1214.8784 1221.9807 1240.0329 1255.1911 1259.8607 1262.9295 1268.9920 1271.5959 1281.0141 1285.4832 1314.8728 1315.3212 1318.6931 1336.8283 1344.4718 1360.6742 1367.9386 1395.3139 1398.0875 1448.7529 1466.6119 1473.7895 1481.0125 1481.0811 1485.0639 1487.5846 1496.2057 1578.4200 1616.6355 1681.0349 2963.6498 2969.4530 2979.5223 2982.2086 2985.2008 3014.0821 3017.9242 3020.6058 3022.5916 3059.3187 3071.2466 3071.8913 3072.5285 3076.5203 3080.1727 3084.4217 3099.6516 3101.1772 3108.7700 3160.6664 3192.7871
redmass: 3.6391 4.6161 4.3738 1.7209 4.6095 2.8809 3.3596 4.4989 3.6870 3.0350 1.7318 1.3419 2.0545 2.1130 3.9242 3.7419 3.0915 2.2900 4.2830 2.3668 3.8554 3.2407 2.5177 6.8102 4.6526 4.4458 5.3106 1.7200 1.6979 2.0543 1.9915 3.2641 2.3579 4.2813 2.9615 2.6798 1.8359 2.4840 2.3383 2.1001 1.5379 1.9208 2.5069 2.2621 1.8034 1.7631 1.4006 1.9531 1.5134 1.7794 2.4245 3.9999 1.2344 1.1219 2.6242 1.6458 1.8186 2.3855 2.1938 2.2759 1.3196 1.2545 1.5689 1.2936 1.7472 1.3404 1.1557 1.5486 1.6145 1.4680 1.7430 1.7531 1.4586 2.0159 1.4769 1.4379 1.6105 1.2171 1.2051 1.0963 1.0719 1.0669 1.1015 1.0551 1.0551 1.0484 1.0520 5.7438 12.0148 11.3699 1.0655 1.0589 1.0365 1.0500 1.0642 1.0899 1.0709 1.0621 1.0973 1.0856 1.0875 1.0986 1.0991 1.1000 1.1037 1.1008 1.1024 1.0890 1.0943 1.0876 1.1097
irintensity: 0.0100 1.1683 0.8643 0.2440 0.0043 0.7498 3.3423 5.6502 0.5214 0.3254 0.3622 0.2131 1.4130 3.2601 3.7636 10.7290 5.8844 5.0361 1.4767 2.3420 0.4270 1.1637 3.8738 12.8343 7.1584 12.9547 2.1705 49.4748 0.6580 24.2313 23.9347 1.7654 7.8662 1.2232 5.0187 18.4895 16.2413 1.6746 3.9748 2.3247 0.8522 10.6707 1.4044 0.2998 0.7992 0.1238 11.4284 7.1261 10.6675 2.2450 1.2690 10.0271 5.5732 1.8561 26.5776 18.7791 1.7761 43.3247 10.2610 27.2638 21.7856 0.7820 0.1719 0.5653 4.9837 0.8715 2.2155 1.8234 3.8971 21.5007 11.4579 57.0026 29.7359 82.9827 17.8227 32.9182 38.4309 19.4078 17.6904 20.8321 0.6548 8.1033 12.2371 16.2747 12.6583 12.4911 4.6989 4.5940 482.4545 31.3852 18.5290 28.7251 28.7091 59.0751 7.6226 11.2225 32.7715 30.7522 36.2486 3.3021 6.9883 50.5973 41.4548 60.3558 24.4338 30.7002 24.3564 25.8181 8.4292 4.2527 19.4312
temp: 298.150 k
press: 1.00000 atm
elementType: 8 8 7 6 6 6 6 6 6 6 6 6 6 6 6 6 6 6 1 1 1 1 1 1 1 1 1 1 1 1 1 1 1 1 1 1 1 1 1
symmnumber: 1
zpe: 871341.7 jmol-1
zpe.correction: 0.331877 hartree
zpe.thermalcorrener: 0.349035 hartree
zpe.thermalcorrenthalpy: 0.349979 hartree
zpe.thermalcorrgfe: 0.286165 hartree
zpe.sumelectzpe: -788.027053 hartree
zpe.sumelectthermal: -788.009895 hartree
zpe.sumelectthermalent: -788.008951 hartree
zpe.sumelectthermalfe: -788.072765 hartree
dipole: 1.3803 0.0641 -0.6616
dipole: 1.5320
quadrupole: -96.5138 -121.4600 -106.4085
quadrupole: 0.9144 -2.6789 -5.4054
quadrupole: 11.6136 -13.3325 1.7190 0.9144 -2.6789 -5.4054
hfenergy: -788.3589297 hartree
pointgroup: C01 [X(C15H21N1O2)]
dipole: -0.5434671 -0.0224239 0.2596931 debye
polarizability: 196.0676047|-1.980321|166.9697365|-6.9043841|-1.508468|125.324411 unknown
InChI: InChI=1S/C15H21NO2/c1-3-9(4-2)8-16-14(17)12-10-5-6-11(7-10)13(12)15(16)18/h5-6,9-13H,3-4,7-8H2,1-2H3
charge 0 multiplicity 1
39 atoms
O  0.245835 -2.312394 0.321394
O  0.018864 2.285817 -0.560955
N  0.436614 -0.012292 -0.184782
C  -1.632924 -0.72392 0.780942
C  -1.711405 0.806325 0.475736
C  -2.806226 -1.329498 -0.10153
C  -2.917073 0.906642 -0.555498
C  -2.715574 -0.414084 -1.364173
C  -4.101482 -0.796427 0.528445
C  -4.168368 0.540076 0.256953
C  -0.24163 -1.154927 0.309055
C  -0.356009 1.163278 -0.140161
C  1.806237 -0.059615 -0.7332
C  2.901105 -0.195191 0.361538
C  4.285686 -0.434965 -0.303816
C  2.923171 1.010616 1.342779
C  4.447507 -1.829281 -0.951009
C  3.324015 2.371198 0.726391
H  -1.75758 -0.989104 1.843112
H  -1.890983 1.444601 1.355666
H  -2.72877 -2.416148 -0.246274
H  -2.939702 1.854102 -1.111812
H  -1.749742 -0.47429 -1.897283
H  -3.537951 -0.598754 -2.073418
H  -4.779392 -1.386351 1.150619
H  -4.911055 1.258061 0.614059
H  1.857411 -0.925391 -1.416973
H  1.945904 0.868311 -1.31599
H  2.656593 -1.102953 0.951415
H  5.064711 -0.309565 0.474941
H  4.479572 0.350966 -1.061563
H  1.925311 1.112017 1.815956
H  3.626128 0.762136 2.163743
H  3.751296 -1.981321 -1.796002
H  4.254308 -2.631267 -0.214591
H  5.472619 -1.96579 -1.341811
H  2.599808 2.696468 -0.04141
H  3.345502 3.153444 1.507328
H  4.32947 2.332471 0.269178
