program: Gaussian 09
title: 000254725
version: EM64L-G09RevD.01
frameworkgroup: C1[X(C10H9Cl2NO)]
method: RPBEPBE
basis: SDD
operation: Freq
keyword: #p
keyword: freq=noraman
keyword: PBEPBE/SDD
title: #p freq=noraman PBEPBE/SDD
converged: YES YES NO NO
title: Mulliken charges:
elementType: Cl Cl O N C C C C C C C C C C H H H H H H H H H
charge: -0.013787 -0.048460 -0.243548 -0.008970 -0.399418 -0.281976 -0.414731 0.495976 -0.301849 -0.311866 -0.194630 -0.224643 -0.107535 -0.146028 0.245796 0.245923 0.210801 0.210476 0.245958 0.245949 0.256127 0.282636 0.257799
chargesum: 0.00000
title: Mulliken charges with hydrogens summed into heavy atoms:
elementType: Cl Cl O N C C C C C C C C C C
charge: -0.013787 -0.048460 -0.243548 -0.008970 0.092300 0.139301 0.077176 0.495976 -0.301849 -0.055739 0.088006 0.033156 -0.107535 -0.146028
polarizability: 2.05602117e+02 1.66369917e+01 1.34542697e+02 -1.62306290e-01 6.07189658e-02 6.39915550e+01
1716.lowfreq: -9.3049 -6.8409 -0.0022 -0.0007 0.0020 2.9209 26.4177 45.1732 47.3186
frequency: 26.4142 44.9630 47.2627 81.7544 130.0638 134.1068 138.7094 162.9028 168.2406 213.8038 267.4753 331.1474 353.3788 371.3324 372.0807 416.0796 439.7213 517.7061 548.2155 551.7751 636.5721 700.9486 702.0573 757.8834 796.9506 806.2760 865.0460 868.1205 925.1402 927.0148 990.0976 1031.4573 1038.9874 1083.2593 1087.6379 1093.0878 1148.1644 1171.9799 1232.7683 1254.8482 1267.4543 1268.2638 1287.3243 1338.7283 1359.4735 1381.3438 1392.8127 1452.4610 1460.2047 1474.7541 1487.6788 1570.5074 1594.8532 2203.5264 2944.5005 2986.4786 3004.0841 3029.1692 3037.8461 3097.8227 3158.4478 3179.2113 3182.8087
redmass: 8.8522 2.7663 8.3388 3.4792 8.4343 2.3626 6.2186 13.3163 4.8477 9.0930 6.7916 7.7372 5.0527 3.6298 11.8719 10.7068 3.2178 5.4471 4.1111 5.5408 7.8049 3.6407 7.6678 1.1336 1.4989 7.5727 1.3797 1.2558 1.3419 5.8997 6.6013 4.0702 3.8319 2.5943 2.8525 1.6098 1.3154 1.1522 3.0334 1.4669 1.2416 1.2226 1.0781 1.3923 4.4712 2.0376 2.6696 1.0870 2.1963 1.1412 1.1302 7.7776 7.5522 12.4478 1.0548 1.0585 1.1073 1.0599 1.1010 1.1054 1.0881 1.0963 1.0939
irintensity: 2.9097 6.0036 2.5093 1.0585 3.2835 1.3944 3.5879 2.2677 0.0006 0.1215 4.3779 0.3530 0.5432 0.6940 2.4404 1.7999 6.3716 3.0338 7.6753 2.5078 23.0486 2.9077 68.7516 11.3670 46.5661 14.4495 22.3595 0.2217 0.0056 12.6857 28.4770 73.5388 23.6233 11.3350 38.9610 0.5958 3.3262 0.5288 167.6264 93.1360 9.0869 6.1979 0.0923 1.7552 17.2087 32.0901 7.8711 6.4977 245.0479 28.3096 1.4261 21.5121 6.8374 11.4499 37.8801 9.7506 32.7285 10.7112 3.2585 24.0416 7.8260 1.9866 1.5516
temp: 298.150 k
press: 1.00000 atm
elementType: 17 17 8 7 6 6 6 6 6 6 6 6 6 6 1 1 1 1 1 1 1 1 1
symmnumber: 1
zpe: 434215.6 jmol-1
zpe.correction: 0.165384 hartree
zpe.thermalcorrener: 0.179562 hartree
zpe.thermalcorrenthalpy: 0.180506 hartree
zpe.thermalcorrgfe: 0.121634 hartree
zpe.sumelectzpe: -1435.506725 hartree
zpe.sumelectthermal: -1435.492547 hartree
zpe.sumelectthermalent: -1435.491603 hartree
zpe.sumelectthermalfe: -1435.550475 hartree
dipole: -1.2418 -4.0764 0.0089
dipole: 4.2613
quadrupole: -138.0273 -90.1599 -96.1389
quadrupole: -12.1431 0.0185 0.0291
quadrupole: -29.9186 17.9488 11.9698 -12.1431 0.0185 0.0291
hfenergy: -1435.6721095 hartree
pointgroup: C01 [X(C10H9Cl2N1O1)]
dipole: 0.5347874 1.582141 0.1469937 debye
dipolederiv: -0.1558858 -0.1803447 -0.0156908 -0.2235461 -0.6452834 -0.0546096 -0.0195638 -0.0544274 -0.039885 -0.8538729 -0.1336834 -0.0056955 -0.1200036 -0.1491028 -0.0072162 -0.0047398 -0.0071686 -0.0604865 -2.0772006 0.1788023 0.0356045 0.0806753 -0.2465402 -0.0000116 0.0227993 -0.0015721 -0.2580169 -0.3345651 0.0197257 0.0031386 -0.0628927 -0.213428 0.0021499 -0.0051935 0.0012004 -0.2279231 0.0195191 -0.0404907 -0.0028173 -0.0992005 0.042785 -0.0069411 -0.0087017 -0.0081218 0.1275659 0.9504369 -0.1805619 -0.0239358 -0.5015704 0.3719837 0.0013289 -0.0541457 -0.0008318 0.4041475 -0.0630535 -0.0425521 -0.0004923 -0.08976 0.1593521 -0.0094526 -0.0053167 -0.0098291 0.2552497 1.607083 -0.1043035 -0.0234884 0.3189796 -0.2528612 -0.0393171 0.0195179 -0.0345208 0.1230542 -0.0745581 0.253242 0.023842 0.4036681 0.9891592 0.0973675 0.0382849 0.0981718 -0.0909523 -0.2129428 0.1483568 0.0140835 -0.2548642 0.0198182 0.0224566 -0.0245255 0.0182476 -0.1906127 -0.2498492 -0.0921835 -0.0067161 -0.0832908 -0.1738755 -0.0109342 -0.0060527 -0.0106155 -0.0517326 -0.2181304 -0.1375049 -0.0116619 0.017241 0.0293564 0.01177 0.0023802 0.0130221 -0.1016529 1.1666044 0.2215524 0.0102445 0.1559036 0.0770723 0.0143111 0.0042738 0.0138618 -0.0889209 0.1598699 0.0924909 0.0068578 0.1970671 -0.0395973 0.0000031 0.0178332 0.0011684 -0.0620025 0.0681692 0.0112795 -0.0159736 -0.0131522 0.0359903 -0.072918 -0.0120747 -0.0810566 -0.0477671 0.0696232 0.0105542 0.0156333 -0.0130265 0.0013682 0.0834555 0.006553 0.0909211 -0.0131114 -0.0292221 -0.0158063 -0.0355038 0.1037125 -0.0357026 -0.0880799 0.010211 -0.1044975 -0.102226 -0.0284135 -0.020492 0.0309167 0.1047337 -0.0761286 0.0916297 0.0101648 0.1101908 -0.0623675 0.057023 -0.0324967 -0.0176292 -0.0075966 0.0505066 -0.0681911 -0.0062979 -0.0969455 -0.0250764 0.0574479 -0.0324009 0.0091711 -0.0063842 0.0134051 0.0767547 0.003037 0.1061256 0.0116038 0.0050126 0.0814568 0.0088584 0.103975 0.0012171 -0.0163347 0.0109172 -0.0158772 0.1653561 0.0668862 0.0430133 0.0047801 0.0407524 0.05392 -0.0109613 0.0043856 -0.0110937 0.1687118 0.0700185 -0.0476532 -0.0035259 -0.0514204 -0.0134144 -0.0162595 -0.0037459 -0.016352 0.1670448 unknown
polarizability: 206.4927373|14.6139126|133.066932|0.0236854|6.2921707|64.5766993 unknown
InChI: InChI=1S/C10H9Cl2NO/c11-8-3-4-10(9(12)7-8)14-6-2-1-5-13/h3-4,7H,1-2,6H2
charge 0 multiplicity 1
23 atoms
Cl 1.224441 -2.906094 -0.303025
Cl 5.500077 0.624816 -0.011432
O  -0.436012 -0.46605 -0.065333
N  -6.352546 -0.045344 0.050027
C  -2.794611 -0.032182 0.002861
C  -1.413483 0.627787 0.054992
C  -3.916662 1.035323 0.130345
C  0.919948 -0.135919 -0.045491
C  1.843537 -1.211172 -0.152145
C  1.429226 1.18187 0.072377
C  3.231296 -0.9915 -0.142548
C  2.821796 1.420862 0.083119
C  3.703191 0.331889 -0.024188
C  -5.264214 0.442199 0.086184
H  -2.901041 -0.582913 -0.947711
H  -2.877953 -0.769369 0.820132
H  -1.259828 1.163413 1.015595
H  -1.279147 1.345683 -0.781595
H  -3.812142 1.591718 1.082487
H  -3.83643 1.77844 -0.687278
H  0.748178 2.032984 0.156883
H  3.92293 -1.833409 -0.225212
H  3.205949 2.440364 0.173655
