program: Gaussian 09
title: 000254722
version: EM64L-G09RevD.01
frameworkgroup: C1[X(C13H12N2O3)]
method: RPBEPBE
basis: SDD
operation: Freq
keyword: #p
keyword: freq=noraman
keyword: PBEPBE/SDD
title: #p freq=noraman PBEPBE/SDD
converged: NO YES NO NO
title: Mulliken charges:
elementType: O O O N N C C C C C C C C C C C C C H H H H H H H H H H H H
charge: -0.367961 -0.433419 -0.238710 -0.457356 -0.698686 0.492373 0.404944 -0.424108 -0.320667 0.508623 -0.336035 -0.335408 -0.394210 -0.394314 -0.356453 -0.345688 0.279487 0.211262 0.223566 0.300373 0.330935 0.240406 0.240386 0.218173 0.218167 0.220356 0.252099 0.305372 0.305386 0.351107
chargesum: 0.00000
title: Mulliken charges with hydrogens summed into heavy atoms:
elementType: O O O N N C C C C C C C C C C C C C
charge: -0.367961 -0.082312 -0.238710 -0.126421 -0.087928 0.492373 0.404944 -0.200542 -0.020294 0.508623 -0.095629 -0.095022 -0.176037 -0.176146 -0.136097 -0.093589 0.279487 0.211262
polarizability: 2.90630826e+02 -1.66484322e+01 1.25673057e+02 -1.81734849e-01 -9.37161544e-02 1.09429538e+02
1716.lowfreq: -31.0579 -4.5410 -0.0009 -0.0004 -0.0003 2.6487 13.4317 26.0908 39.0575
frequency: -30.8522 25.3780 39.0203 56.8541 73.0102 117.6917 174.2346 180.7764 217.3036 306.4055 320.1228 334.2311 337.9275 352.8715 356.7470 366.4455 405.3203 411.3619 413.2542 415.8361 451.8253 504.4888 516.4660 560.3303 629.1518 633.6281 640.0297 670.6224 689.9737 710.7002 724.9876 728.6820 793.1364 793.6546 801.3243 824.4487 826.2893 846.3451 861.5753 909.8138 930.6337 940.8323 941.8535 976.7425 995.0381 1000.2519 1014.7990 1109.9389 1121.2735 1130.7434 1149.5906 1161.8910 1182.1165 1191.2495 1237.4501 1270.8574 1296.8409 1315.7068 1317.2471 1386.2320 1391.4917 1429.0251 1434.6248 1492.7110 1505.3208 1528.3046 1593.1150 1603.4361 1630.3687 1638.2385 1644.9430 1685.2876 3113.5326 3126.2216 3128.7682 3136.6364 3160.7340 3164.9106 3166.1479 3189.6435 3540.3539 3573.6708 3583.3431 3713.5712
redmass: 4.1110 5.8774 6.1928 6.6492 6.2422 5.7474 5.8911 6.0571 7.6849 7.0246 4.2422 1.2773 1.1191 1.0410 5.8586 5.5368 4.1018 3.0417 2.8002 3.5604 8.2779 2.6877 2.3832 6.4367 6.8388 3.3840 1.7238 4.6363 4.5538 3.7908 5.6550 4.3639 5.8580 1.3969 1.2593 1.9624 5.5690 1.4604 5.6662 1.3702 1.6104 4.9660 1.3510 1.3087 2.8291 2.7543 1.4233 1.4054 1.1867 3.1713 1.4967 1.4479 1.1062 1.9144 1.9038 2.8190 1.3157 1.6855 2.2577 6.0784 5.4863 3.5522 3.5492 2.0890 2.9909 2.6776 7.4530 5.8340 2.5378 6.4419 1.6062 9.4340 1.0871 1.0891 1.0886 1.0972 1.0956 1.0965 1.0899 1.0961 1.0759 1.0449 1.0661 1.1040
irintensity: 0.5561 3.8371 2.8409 0.0401 1.7191 2.8964 1.8126 1.3055 2.0130 8.6337 0.1009 292.1440 143.6002 0.1740 43.0493 0.0929 17.3325 2.7451 0.0019 3.4583 14.9273 18.2077 42.6680 10.7763 4.0257 10.8537 24.6776 0.4802 45.0792 0.8080 23.2133 0.1886 11.6535 54.4686 0.1617 87.8274 3.8549 54.6254 9.8589 2.6540 38.7634 261.6039 0.1431 1.6045 28.5534 0.5149 0.0338 26.2808 20.8655 946.2019 14.9169 13.4266 1.0421 122.4092 19.1360 15.9920 0.0223 0.6332 32.2722 3.5970 193.7235 131.0901 1.0386 90.6334 520.3280 317.8562 0.6567 18.9836 5.5121 3.8036 262.4496 265.2009 22.8171 12.2900 36.0632 16.2152 15.1283 0.6387 3.5919 5.0452 31.3386 80.0053 45.5163 21.0775
temp: 298.150 k
press: 1.00000 atm
elementType: 8 8 8 7 7 6 6 6 6 6 6 6 6 6 6 6 6 6 1 1 1 1 1 1 1 1 1 1 1 1
symmnumber: 1
zpe: 597343.0 jmol-1
zpe.correction: 0.227516 hartree
zpe.thermalcorrener: 0.242917 hartree
zpe.thermalcorrenthalpy: 0.243861 hartree
zpe.thermalcorrgfe: 0.183869 hartree
zpe.sumelectzpe: -836.493079 hartree
zpe.sumelectthermal: -836.477678 hartree
zpe.sumelectthermalent: -836.476734 hartree
zpe.sumelectthermalfe: -836.536726 hartree
dipole: 1.9864 2.8469 0.0192
dipole: 3.4715
quadrupole: -57.9011 -104.7427 -99.7781
quadrupole: -21.2251 -0.1524 -0.0907
quadrupole: 29.5729 -17.2687 -12.3042 -21.2251 -0.1524 -0.0907
hfenergy: -836.7205949 hartree
pointgroup: C01 [X(C13H12N2O3)]
dipole: -0.787973 -1.1155447 -0.0005507 debye
polarizability: 290.432813|-17.6017501|125.8688807|0.0915298|0.2066159|109.4317272 unknown
InChI: InChI=1S/C13H12N2O3/c14-9-1-7-12(8-2-9)18-13(17)15-10-3-5-11(16)6-4-10/h1-8,15-16H,14H2
charge 0 multiplicity 1
30 atoms
O  -1.112273 -1.039703 -0.001479
O  6.518621 0.886269 0.002051
O  -0.1511 1.136333 0.000307
N  1.132119 -0.861071 -0.001254
N  -6.452653 0.837363 0.000679
C  2.476548 -0.391858 -0.000365
C  -2.444879 -0.507958 -0.000945
C  3.512067 -1.360472 -0.000583
C  2.813147 0.989319 0.000668
C  -5.128581 0.394212 0.000122
C  -3.105911 -0.290732 -1.224822
C  -3.101825 -0.281475 1.223471
C  -4.440804 0.156788 -1.226636
C  -4.436668 0.166125 1.226337
C  4.86504 -0.965453 0.000207
C  4.164729 1.380969 0.001451
C  5.191901 0.411145 0.001225
C  -0.026521 -0.108246 -0.001156
H  3.264328 -2.429096 -0.001373
H  2.017351 1.737134 0.000819
H  0.983772 -1.872711 -0.002066
H  -2.577423 -0.470494 -2.166496
H  -2.570233 -0.454014 2.164747
H  -4.955041 0.32574 -2.180223
H  -4.9477 0.34239 2.180322
H  5.653772 -1.728326 0.000026
H  4.438143 2.440109 0.002236
H  -6.941979 1.017011 -0.870224
H  -6.938955 1.023838 0.87184
H  7.160608 0.133764 0.001811
