program: Gaussian 09
title: 000254720
version: EM64L-G09RevD.01
frameworkgroup: C1[X(C14H16ClNO4)]
method: RPBEPBE
basis: SDD
operation: Freq
keyword: #p
keyword: freq=noraman
keyword: PBEPBE/SDD
title: #p freq=noraman PBEPBE/SDD
converged: YES YES NO NO
title: Mulliken charges:
elementType: Cl O O O O N C C C C C C C C C C C C C C H H H H H H H H H H H H H H H H
charge: -0.010837 -0.290662 -0.155198 -0.226468 -0.254934 -0.209520 -0.420094 -0.503372 0.454064 -0.401836 -0.339121 0.236737 0.313301 -0.348686 -0.342758 -0.073513 -0.715762 0.186348 -0.257720 -0.663337 0.299242 0.230904 0.253972 0.244883 0.261135 0.246887 0.277561 0.276128 0.197334 0.284077 0.293681 0.222586 0.237163 0.220132 0.226526 0.251156
chargesum: 0.00000
title: Mulliken charges with hydrogens summed into heavy atoms:
elementType: Cl O O O O N C C C C C C C C C C C C C C
charge: -0.010837 -0.290662 -0.155198 -0.226468 -0.254934 -0.209520 0.110052 -0.004517 0.454064 -0.140701 -0.092233 0.236737 0.313301 -0.071125 -0.066630 0.123822 -0.138004 0.186348 0.202029 0.034477
polarizability: 2.64586233e+02 4.10156584e+01 1.47039003e+02 1.61189632e+01 -1.26167105e+01 1.56409830e+02
1716.lowfreq: -7.7288 -4.6787 0.0010 0.0011 0.0021 1.9943 9.8863 12.2754 27.3349
frequency: 9.8344 12.2452 27.2837 40.2978 55.9706 58.0113 76.8990 86.5420 91.9601 105.2374 136.2953 160.5069 180.5522 208.8212 219.6983 266.4223 291.8008 302.0027 309.7581 323.6741 333.7975 382.8703 414.4749 433.3028 444.8804 477.1545 478.9134 503.6818 541.0873 615.4050 629.8326 679.7278 683.6636 724.9962 736.5729 756.3697 760.5089 796.8104 817.2220 835.2964 839.9586 846.7691 858.5787 918.6021 958.1055 967.1857 981.2214 991.4308 997.3360 1008.8384 1016.1833 1031.4418 1064.7545 1095.8464 1101.3618 1122.6063 1138.2739 1155.4454 1183.7158 1188.7403 1206.3581 1253.6354 1259.1094 1274.3164 1278.4839 1300.6517 1311.6256 1343.7792 1356.8992 1358.3029 1380.6659 1390.3753 1390.5783 1407.7529 1423.1380 1447.8139 1457.5480 1463.0371 1482.3076 1483.7274 1503.9972 1569.4081 1607.6698 1619.9994 1631.1530 1662.9963 2984.3095 2992.2844 2994.0016 3002.2758 3018.1521 3031.7112 3054.6767 3079.0857 3087.6127 3089.2672 3094.8911 3120.4723 3145.7169 3149.4484 3166.4574 3180.0606
redmass: 9.9198 10.4175 5.0767 3.7863 5.7379 4.4522 4.9634 4.5733 3.9458 3.5727 5.4840 3.4852 6.0852 3.6111 1.5555 4.0068 3.0096 3.3921 3.6741 3.4167 3.6303 4.8263 2.9774 4.1298 3.6498 2.5515 3.8210 6.2140 3.3686 3.2390 7.0407 4.9417 4.7264 5.6785 3.3877 4.7393 2.9018 3.6730 1.4578 2.0546 2.5929 1.3557 1.6770 2.5899 2.4827 1.5903 1.3505 1.3717 3.1509 2.6794 2.7598 2.4119 4.0709 2.1706 2.5473 1.4039 1.1545 1.6749 1.5591 1.3953 1.3762 3.4145 2.1193 1.3964 1.1165 1.8058 1.4243 1.3953 1.3071 1.3737 4.0351 1.2939 1.4091 1.0870 3.6036 1.0966 1.0985 1.0461 1.0956 1.0530 2.6662 7.8003 6.6176 9.7231 6.8724 9.1230 1.0873 1.0610 1.0361 1.0639 1.0574 1.0593 1.1014 1.0983 1.1055 1.0975 1.1034 1.1061 1.0886 1.0891 1.0965 1.0956
irintensity: 2.2929 0.4521 0.4693 0.8664 3.7281 3.4055 3.4851 2.4194 3.6832 1.5475 2.8732 7.0295 1.4960 2.3817 1.1944 0.2319 3.7067 3.2035 8.9090 4.0202 20.9421 6.9546 3.3860 14.7237 2.3798 18.4160 0.8655 13.5740 7.7269 5.2973 1.1174 14.9942 22.1638 34.9499 9.9429 8.0986 15.0420 7.6991 1.9883 4.6420 19.0918 2.4296 47.5398 6.4453 11.8658 7.5124 1.7969 0.8963 5.5390 61.3113 47.3200 32.7012 307.6873 24.7959 68.3297 13.1065 4.6714 60.0708 230.4534 60.6775 13.5902 338.2695 27.0338 26.5990 2.1592 100.4839 37.9686 12.8809 2.3953 32.9423 15.7801 26.0538 1.7526 25.0704 3.7214 14.6972 30.6370 14.3297 26.5452 23.9831 92.8711 43.4270 506.1354 163.5388 55.2852 103.6457 46.8860 15.2897 21.6413 23.4404 11.0397 35.4503 15.9116 3.6114 2.2716 38.7137 1.2014 29.8190 2.8570 9.3383 4.4443 2.5519
temp: 298.150 k
press: 1.00000 atm
elementType: 17 8 8 8 8 7 6 6 6 6 6 6 6 6 6 6 6 6 6 6 1 1 1 1 1 1 1 1 1 1 1 1 1 1 1 1
symmnumber: 1
zpe: 726926.0 jmol-1
zpe.correction: 0.276871 hartree
zpe.thermalcorrener: 0.297530 hartree
zpe.thermalcorrenthalpy: 0.298475 hartree
zpe.thermalcorrgfe: 0.222198 hartree
zpe.sumelectzpe: -1357.311150 hartree
zpe.sumelectthermal: -1357.290491 hartree
zpe.sumelectthermalent: -1357.289547 hartree
zpe.sumelectthermalfe: -1357.365824 hartree
dipole: 6.0496 -0.0245 5.1862
dipole: 7.9684
quadrupole: -145.9808 -134.9821 -116.3345
quadrupole: -4.6828 -3.5153 -0.5633
quadrupole: -13.5483 -2.5496 16.0979 -4.6828 -3.5153 -0.5633
hfenergy: -1357.5880217 hartree
pointgroup: C01 [X(C14H16Cl1N1O4)]
dipole: 2.2688224 -0.799668 -2.0103055 debye
polarizability: 266.9477232|-40.4853506|136.5598423|-3.9966735|-1.3966555|164.5275005 unknown
InChI: InChI=1S/C14H16ClNO4/c1-2-20-14(19)11-3-5-12(6-4-11)16(10-17)8-7-13(18)9-15/h3-6,10H,2,7-9H2,1H3
charge 0 multiplicity 1
36 atoms
Cl -3.729553 -2.902386 2.095827
O  4.144089 -0.804235 -0.820959
O  -4.711481 -0.775549 0.128549
O  -3.605362 2.881733 0.070975
O  4.024741 -0.45868 1.487585
N  -1.938758 1.323947 -0.518689
C  -2.789578 0.742289 -1.590293
C  -2.895735 -0.797889 -1.502848
C  -0.594005 0.877655 -0.316822
C  -0.045642 0.8217 0.996393
C  0.209591 0.478138 -1.419904
C  2.08642 0.015407 0.087392
C  -3.60837 -1.251582 -0.214729
C  1.283572 0.406298 1.189478
C  1.53391 0.050062 -1.21878
C  -2.450639 2.410035 0.217057
C  -2.845342 -2.317844 0.570764
C  3.485752 -0.423328 0.352387
C  5.571688 -1.225964 -0.672863
C  6.501413 -0.010186 -0.718785
H  -3.787531 1.194844 -1.459208
H  -2.409809 1.036284 -2.587283
H  -3.514282 -1.13939 -2.356301
H  -1.905264 -1.277657 -1.601404
H  -0.667266 1.070236 1.862633
H  -0.192807 0.528544 -2.436565
H  1.715487 0.358548 2.194401
H  2.155107 -0.248533 -2.06745
H  -1.709673 2.832811 0.926148
H  -2.668492 -3.203376 -0.064649
H  -1.868633 -1.913252 0.890957
H  5.730795 -1.903861 -1.526646
H  5.677055 -1.776154 0.27846
H  7.554563 -0.346365 -0.692386
H  6.347423 0.570035 -1.644847
H  6.328613 0.646865 0.149702
