program: Gaussian 09
title: 000254718
version: EM64L-G09RevD.01
frameworkgroup: C1[X(C9H16O5)]
method: RPBEPBE
basis: SDD
operation: Freq
keyword: #pfreq=noraman
keyword: PBEPBE/SDD
title: #p freq=noraman PBEPBE/SDD
converged: YES YES NO NO
title: Mulliken charges:
elementType: O O O O O C C C C C C C C C H H H H H H H H H H H H H H H H
charge: -0.299988 -0.275301 -0.245901 -0.288631 -0.447089 -0.157352 -0.124538 -0.112751 0.343123 -0.045751 -0.317671 -0.691193 -0.688742 -0.499755 0.257707 0.243044 0.250834 0.233869 0.232935 0.224953 0.215680 0.268896 0.210546 0.220535 0.216480 0.238458 0.353879 0.234765 0.216727 0.232234
chargesum: 0.00000
title: Mulliken charges with hydrogens summed into heavy atoms:
elementType: O O O O O C C C C C C C C C
charge: -0.299988 -0.275301 -0.245901 -0.288631 -0.093210 0.100354 0.118507 0.138083 0.343123 0.188118 0.140217 0.003928 -0.013270 0.183972
polarizability: 1.23116427e+02 3.25498302e+00 1.10594454e+02 -3.60445272e+00 -1.43057852e+00 9.64537177e+01
1716.lowfreq: -6.2515 -0.0008 -0.0007 -0.0004 11.2467 18.3405 45.1064 73.8984 98.3732
frequency: 44.9769 73.8699 98.3399 103.5285 123.5266 149.2344 165.8857 176.8413 188.5957 221.2302 286.4274 295.3834 317.1482 324.9823 359.4635 366.9630 397.3743 418.8222 437.3515 482.4647 493.5090 583.0334 633.2517 683.2002 721.6547 735.7218 752.9086 839.4162 852.8572 887.2004 922.6878 932.3439 950.2903 966.5040 984.5689 998.6615 1008.5465 1025.7168 1035.0893 1059.5298 1102.0967 1112.4012 1139.4126 1142.1988 1150.4969 1188.0340 1205.8846 1235.8697 1248.9156 1256.2677 1280.8029 1291.7286 1308.1905 1328.0047 1334.4502 1353.7947 1371.3698 1377.8328 1382.1329 1391.6758 1430.5053 1447.5748 1455.4379 1457.7977 1466.5575 1474.9136 1480.9831 1481.0774 2962.6331 2995.6993 3004.6595 3013.6917 3018.5767 3020.5367 3033.8061 3043.7671 3056.0855 3085.3753 3092.2338 3106.6923 3116.7153 3118.9707 3119.5809 3556.3597
redmass: 3.7760 2.8528 2.6563 2.5765 1.7946 3.1510 1.1399 2.3394 3.6385 1.0971 3.7608 3.6069 3.0854 3.2421 2.4045 5.1874 1.3315 3.6303 4.1809 4.8220 4.6399 5.2093 4.8489 5.4470 7.8855 4.5433 3.9195 4.4061 2.7211 4.0084 1.5290 3.4304 2.2870 4.1462 1.3179 5.0070 6.0128 5.3223 3.4757 3.0454 2.4578 1.2715 1.9080 1.7568 1.5822 1.4436 2.6933 1.1977 2.2973 1.7204 1.2818 1.1911 1.2155 1.2529 1.2977 1.2469 1.5581 1.2901 1.3229 1.2306 1.1452 1.0547 1.0489 1.0515 1.0568 1.0595 1.0736 1.0556 1.0327 1.0354 1.0355 1.0805 1.0628 1.0850 1.0860 1.0884 1.1024 1.1078 1.0996 1.0995 1.1006 1.1011 1.1010 1.0659
irintensity: 0.5543 2.3648 1.5301 5.9225 1.4239 2.3162 0.3060 8.3432 4.2567 2.0421 11.2014 6.6294 4.2165 0.3701 22.6072 2.9822 127.1919 4.6419 3.7854 7.8909 16.3377 6.6709 0.7499 10.2075 5.9805 16.7077 39.3437 34.3879 14.0905 19.4058 1.2050 83.0832 28.5876 160.6729 2.4726 110.9125 68.5964 102.2183 29.9172 18.7097 26.2560 0.5142 35.3081 15.2406 6.8113 1.6882 107.5026 28.2192 51.7351 17.7592 1.6112 2.7590 1.9636 5.3923 5.0578 11.0762 14.4668 34.8428 5.6406 29.3924 4.2697 1.1674 4.3084 9.5798 7.8547 7.5680 10.6910 14.3041 66.4435 16.7625 19.4741 32.2691 30.5623 17.6887 14.7339 57.3074 37.0591 31.7105 9.3352 27.7101 11.4273 1.9882 32.9202 9.3500
temp: 298.150 k
press: 1.00000 atm
elementType: 8 8 8 8 8 6 6 6 6 6 6 6 6 6 1 1 1 1 1 1 1 1 1 1 1 1 1 1 1 1
symmnumber: 1
zpe: 648022.4 jmol-1
zpe.correction: 0.246819 hartree
zpe.thermalcorrener: 0.261731 hartree
zpe.thermalcorrenthalpy: 0.262675 hartree
zpe.thermalcorrgfe: 0.205578 hartree
zpe.sumelectzpe: -727.492401 hartree
zpe.sumelectthermal: -727.477489 hartree
zpe.sumelectthermalent: -727.476545 hartree
zpe.sumelectthermalfe: -727.533643 hartree
dipole: 0.0073 -1.6946 0.9107
dipole: 1.9238
quadrupole: -82.5909 -85.0827 -81.3672
quadrupole: -6.3094 0.3736 -2.8835
quadrupole: 0.4227 -2.0691 1.6464 -6.3094 0.3736 -2.8835
hfenergy: -727.7392202 hartree
pointgroup: C01 [X(C9H16O5)]
dipole: 0.2558729 -0.5560031 0.4452639 debye
polarizability: 117.9631347|7.4109003|115.6200819|0.2231449|-3.3289834|96.5813816 unknown
InChI: InChI=1S/C9H16O5/c1-9(2)13-6-5(10)4-12-8(11-3)7(6)14-9/h5-8,10H,4H2,1-3H3
charge 0 multiplicity 1
30 atoms
O  -1.892691 0.315692 -0.305455
O  -0.533943 -1.486976 -1.018701
O  2.217872 1.099634 -0.817397
O  1.59301 -0.640036 0.75173
O  -0.703004 3.040898 0.473573
C  -0.64213 0.921258 -0.804057
C  0.244519 -0.271676 -1.27631
C  0.028756 1.782738 0.279383
C  -1.70918 -1.15921 -0.164281
C  1.656609 -0.245558 -0.638121
C  1.446636 2.196535 -0.160121
C  -1.444777 -1.533621 1.299682
C  -2.932778 -1.845558 -0.770067
C  2.917621 -0.916406 1.333294
H  -0.923417 1.579475 -1.646453
H  0.405287 -0.218347 -2.367627
H  0.064576 1.201638 1.219212
H  2.361643 -0.892428 -1.194915
H  1.374453 3.008055 -0.905156
H  2.028828 2.553531 0.70707
H  -1.370269 -2.631183 1.395789
H  -0.495438 -1.093298 1.641218
H  -2.276935 -1.177373 1.931773
H  -2.790747 -2.939682 -0.768452
H  -3.83437 -1.60334 -0.181679
H  -3.077632 -1.503775 -1.807288
H  -1.62408 2.811803 0.760552
H  3.576505 -0.031668 1.255983
H  3.392949 -1.778408 0.82422
H  2.737426 -1.163412 2.390504
