program: Gaussian 09
title: 000254700
version: EM64L-G09RevD.01
frameworkgroup: C1[X(C6H2Cl3N3)]
method: RPBEPBE
basis: SDD
operation: Freq
keyword: #p
keyword: freq=noraman
keyword: PBEPBE/SDD
title: #p freq=noraman PBEPBE/SDD
converged: NO NO NO NO
title: Mulliken charges:
elementType: Cl Cl Cl N N N C C C C C C H H
charge: 0.051472 0.020290 0.017200 -0.176098 0.019255 0.161647 0.270757 -0.129269 -0.192351 -0.199394 -0.231519 -0.204272 0.304849 0.287433
chargesum: 0.00000
title: Mulliken charges with hydrogens summed into heavy atoms:
elementType: Cl Cl Cl N N N C C C C C C
charge: 0.051472 0.020290 0.017200 -0.176098 0.019255 0.161647 0.270757 0.175580 0.095082 -0.199394 -0.231519 -0.204272
polarizability: 1.92885876e+02 -5.68147768e+00 1.22759024e+02 -2.80494972e-03 9.15067197e-03 4.02404566e+01
1716.lowfreq: -8.4734 -5.0364 0.0014 0.0018 0.0021 7.2316 74.8501 124.3794 143.0367
frequency: 74.8495 124.3793 143.0355 170.9313 182.9857 270.1020 303.1210 321.3029 360.6975 389.6879 439.2181 534.9570 542.6172 619.0691 630.4186 649.7821 719.6875 744.4117 756.3662 813.0396 863.0445 892.7123 938.4382 1064.7165 1113.7808 1185.9732 1236.9692 1255.6502 1279.9322 1376.9236 1452.2938 1471.4914 1489.9964 1601.5314 3212.5898 3268.0835
redmass: 13.9473 6.8321 24.3024 13.2638 25.4216 6.7889 12.1858 23.5754 7.8552 14.8281 10.3258 8.6639 6.7204 5.4806 8.8012 5.5969 3.0230 2.0655 8.4611 5.6900 1.3765 9.1101 6.9738 3.3306 2.2562 3.2076 3.6643 3.1852 5.3250 8.8478 5.5527 10.3845 9.0735 10.1473 1.0947 1.1009
irintensity: 0.0011 1.3957 0.3604 0.4867 0.0353 9.4876 0.4531 0.1236 0.2648 8.1441 15.2368 10.7980 2.3047 4.5262 7.0725 2.6900 11.8196 37.0177 76.2494 45.3726 27.8563 17.2935 6.9326 44.9903 92.8974 116.7578 41.2320 284.9446 2.0546 169.2125 99.3519 32.4079 88.4746 167.6033 4.3049 11.7076
temp: 298.150 k
press: 1.00000 atm
elementType: 17 17 17 7 7 7 6 6 6 6 6 6 1 1
symmnumber: 1
zpe: 194362.0 jmol-1
zpe.correction: 0.074029 hartree
zpe.thermalcorrener: 0.083889 hartree
zpe.thermalcorrenthalpy: 0.084833 hartree
zpe.thermalcorrgfe: 0.037105 hartree
zpe.sumelectzpe: -1773.405595 hartree
zpe.sumelectthermal: -1773.395735 hartree
zpe.sumelectthermalent: -1773.394791 hartree
zpe.sumelectthermalfe: -1773.442519 hartree
dipole: -0.5637 1.2427 0.0004
dipole: 1.3646
quadrupole: -98.6088 -88.4126 -89.1161
quadrupole: -9.2795 -0.0014 -0.0003
quadrupole: -6.5630 3.6333 2.9297 -9.2795 -0.0014 -0.0003
hfenergy: -1773.4796239 hartree
pointgroup: C01 [X(C6H2Cl3N3)]
dipole: 0.1983642 -0.4988793 0.0001416 debye
dipolederiv: -0.0766579 0.0809312 -0.0000041 -0.0470786 -0.8262852 0.0000567 -0.0000414 -0.0002165 -0.0216383 -0.8841149 -0.0581337 -0.000019 -0.0677469 -0.0644878 0.0000044 -0.0000088 0.0000102 -0.0183393 -0.8133691 0.3142595 -0.0000789 0.3352527 -0.2279609 0.0000404 -0.0000881 0.0000604 -0.0323615 -0.084508 -0.2760422 -0.0000506 -0.7441502 -0.848961 0.0001265 0.0000928 0.0001021 0.1074379 -0.9997144 0.0933299 -0.0000353 0.0167308 -0.4383394 0.0000507 -0.0000356 0.0000528 -0.1993553 -0.8172365 0.4123776 0.0000613 0.4260684 -0.9126521 0.0000406 -0.0002372 0.0000306 -0.098173 0.5870413 0.0223697 -0.0000159 0.5392847 0.4533926 -0.0000902 -0.0000665 -0.0000797 0.0707924 -0.6258371 -0.0065286 0.0000205 -0.0202969 -0.1217703 -0.0000176 0.0000039 -0.0000652 -0.1526375 -0.3971274 0.1686673 -0.0000581 -0.0029058 -0.1134396 -0.0000019 -0.0000334 0.0000156 -0.0694816 0.785864 -0.1304408 -0.0000495 0.0663584 1.7028021 -0.0000327 0.000213 0.0002721 0.0501631 1.7195334 0.0234494 0.000052 0.1518239 0.4982664 -0.0001074 0.0000386 -0.0000708 -0.0249978 1.3716695 -0.6016523 0.0001637 -0.6591923 0.7582761 -0.000126 0.0001692 -0.0001522 -0.0397068 0.1183161 -0.033154 0.0000124 -0.0106554 0.0817831 0.0000305 -0.0000062 0.0000352 0.2454437 0.1161411 -0.0094331 0.0000015 0.016507 0.0593763 0.0000259 -0.0000004 0.0000054 0.1828539 unknown
polarizability: 192.1912336|-8.9727224|123.4536661|0.0023685|-0.0092732|40.2404566 unknown
InChI: InChI=1S/C6H2Cl3N3/c7-3-1-5-10-4(8)2-12(5)6(9)11-3/h1-2H
charge 0 multiplicity 1
14 atoms
Cl -0.738826 -3.068909 0.000227
Cl 4.148867 0.42493 -0.000028
Cl -3.75228 1.404155 -0.000334
N  0.332347 -0.574387 0.000175
N  1.555536 1.374968 -0.000271
N  -2.033583 -0.683032 0.000134
C  0.299548 0.879125 -0.000113
C  1.676917 -0.953035 0.000079
C  -0.971694 1.511889 -0.000175
C  -0.86405 -1.273198 0.000432
C  2.376937 0.261004 -0.000085
C  -2.096187 0.688325 -0.000101
H  2.008762 -1.985761 0.000241
H  -1.032594 2.600525 -0.000384
