program: Gaussian 09
title: 000254695
version: EM64L-G09RevD.01
frameworkgroup: C1[X(C11H14N4O4)]
method: RPBEPBE
basis: SDD
operation: Freq
keyword: #p
keyword: freq=noraman
keyword: PBEPBE/SDD
title: #p freq=noraman PBEPBE/SDD
converged: NO YES NO NO
title: Mulliken charges:
elementType: O O O O N N N N C C C C C C C C C C C H H H H H H H H H H H H H H
charge: -0.282698 -0.432077 -0.454050 -0.239126 -0.200718 -0.035433 -0.028728 -0.169806 -0.052243 -0.095243 -0.498378 -0.062320 -0.388531 0.108650 -0.222269 -0.080494 0.196865 -0.201963 -0.622853 0.271726 0.221782 0.295226 0.246781 0.233636 0.229659 0.238075 0.289657 0.353434 0.356914 0.248477 0.241814 0.292802 0.241433
chargesum: 0.00000
title: Mulliken charges with hydrogens summed into heavy atoms:
elementType: O O O O N N N N C C C C C C C C C C C
charge: -0.282698 -0.078643 -0.097136 -0.239126 -0.200718 -0.035433 -0.028728 -0.169806 0.219482 0.126539 0.043629 0.171316 0.079204 0.108650 0.067388 -0.080494 0.196865 0.046514 0.153195
polarizability: 2.20097995e+02 9.72500052e+00 1.52427303e+02 -1.60049161e+01 4.89354575e+00 1.01722681e+02
1716.lowfreq: -13.1367 -8.3777 -4.8984 -0.0008 -0.0008 -0.0008 5.2951 33.2882 54.1139
frequency: 3.0517 32.9385 54.1094 70.6016 97.3328 109.7526 113.9284 126.2604 180.6828 205.6546 233.8423 252.7601 268.1406 279.7949 312.8066 330.5425 339.1957 352.3367 378.0581 423.3276 461.9891 518.0451 525.2196 544.0121 555.7459 580.7955 601.6755 634.6490 657.6308 673.0110 688.0355 749.1688 770.6504 796.2663 827.0497 831.8366 884.3466 894.4463 912.7554 932.7959 942.1525 958.6926 991.8129 1002.8957 1034.7122 1041.6128 1058.6330 1060.8675 1115.6972 1124.2970 1137.5505 1160.8512 1177.6638 1183.3232 1203.1443 1232.8285 1257.2384 1268.0212 1282.6817 1293.4781 1304.8338 1307.9459 1316.9474 1321.5548 1347.2028 1352.2237 1356.2130 1380.9253 1384.7138 1396.4044 1416.3083 1457.6470 1470.8749 1474.6579 1475.7601 1496.7666 1497.5036 1537.2627 1671.8557 2962.6708 2988.3182 2999.5547 3008.4764 3038.5847 3056.6384 3092.7148 3095.7536 3119.5635 3127.7724 3152.6159 3266.0351 3507.9649 3583.1867
redmass: 5.1931 7.1570 5.5330 1.1748 4.0193 4.0987 3.5686 4.9680 4.0744 5.0735 1.1112 4.8090 6.7034 5.1143 5.7045 3.8393 3.6502 5.1010 3.7936 4.5561 6.5962 2.6546 1.1419 3.8476 5.7678 6.4326 5.8214 5.2272 6.1641 7.9286 7.1430 5.6712 7.8370 7.0688 1.4307 2.1521 4.5724 1.4101 7.9281 2.4761 4.8123 2.6839 2.5674 3.3005 2.2942 2.4975 1.5400 5.0116 1.5543 1.3089 2.1563 2.6568 2.7077 2.6012 1.3782 1.5282 1.2603 1.6549 1.8813 3.6153 1.4396 1.2779 1.3472 2.5109 2.1569 1.3254 1.6514 1.4683 2.9700 1.5492 1.2594 4.3631 1.0950 1.0987 1.1064 4.9360 1.1007 5.5616 11.6372 1.0841 1.0859 1.0331 1.0616 1.0663 1.0865 1.1053 1.1035 1.1002 1.1016 1.0928 1.0982 1.0654 1.0668
irintensity: 1.2917 0.8141 1.2293 1.1234 2.4582 8.9768 21.2213 3.6855 11.4620 0.9989 162.3982 0.3655 1.2881 12.8306 1.9844 14.4646 3.5168 13.8996 1.9591 10.7002 6.3354 13.9335 133.3687 6.6262 2.8960 1.6778 0.6478 28.0155 26.4745 2.5366 2.6570 22.6358 12.9047 4.3253 17.0590 1.8834 24.3788 11.3132 22.3617 135.9633 3.2927 12.7603 50.5936 123.5802 76.9667 20.0887 32.2508 34.5773 3.6882 0.3233 2.0503 12.0307 38.7186 34.4002 51.2653 26.2856 1.3080 0.9505 46.0074 66.1719 17.4301 37.9091 24.7159 123.6144 3.1438 23.2471 5.7462 5.1089 0.6599 3.7358 18.3684 21.7528 60.4138 19.3055 2.4104 2.1875 19.2569 166.2691 477.9151 19.3070 64.5720 52.6225 33.3178 10.7305 25.9406 34.2123 21.1137 0.4241 2.9048 5.0189 1.7145 33.2212 17.2251
temp: 298.150 k
press: 1.00000 atm
elementType: 8 8 8 8 7 7 7 7 6 6 6 6 6 6 6 6 6 6 6 1 1 1 1 1 1 1 1 1 1 1 1 1 1
symmnumber: 1
zpe: 668119.4 jmol-1
zpe.correction: 0.254473 hartree
zpe.thermalcorrener: 0.271901 hartree
zpe.thermalcorrenthalpy: 0.272846 hartree
zpe.thermalcorrgfe: 0.205992 hartree
zpe.sumelectzpe: -946.030765 hartree
zpe.sumelectthermal: -946.013337 hartree
zpe.sumelectthermalent: -946.012393 hartree
zpe.sumelectthermalfe: -946.079247 hartree
dipole: -3.3499 3.9598 1.5705
dipole: 5.4193
quadrupole: -85.6528 -124.6724 -113.8878
quadrupole: 28.8133 -1.0657 -2.2926
quadrupole: 22.4182 -16.6014 -5.8168 28.8133 -1.0657 -2.2926
hfenergy: -946.2852387 hartree
pointgroup: C01 [X(C11H14N4O4)]
dipole: -1.3502358 1.626156 0.2798901 debye
polarizability: 221.1268359|7.7473183|152.7258927|-12.624682|-4.1100018|100.3952503 unknown
InChI: InChI=1S/C11H14N4O4/c1-14-4-13-10-9(11(14)18)12-5-15(10)8-2-6(17)7(3-16)19-8/h4-8,16-17H,2-3H2,1H3
charge 0 multiplicity 1
33 atoms
O  -2.526116 -0.257491 1.296188
O  -3.58626 1.752608 -1.602619
O  -4.903693 -1.000912 -1.524506
O  4.106213 -1.68342 -0.413485
N  -0.201286 -0.199469 0.733219
N  1.10179 -2.061832 0.420328
N  1.473702 1.573629 0.264108
N  3.63306 0.64008 -0.304525
C  -1.371222 0.638816 1.133494
C  -2.714805 0.865775 -0.845577
C  -1.760633 1.668603 0.054855
C  -3.488198 0.000874 0.182696
C  -3.997927 -1.323545 -0.39543
C  1.070767 0.258606 0.38531
C  -0.119802 -1.60343 0.752294
C  1.859607 -0.904906 0.188631
C  3.255708 -0.781864 -0.191817
C  2.756788 1.690995 -0.078479
C  5.036001 0.936163 -0.681579
H  -1.149476 1.089639 2.115413
H  -2.141117 0.200838 -1.52672
H  -0.886379 2.08234 -0.466694
H  -2.324053 2.49659 0.520419
H  -4.331918 0.599128 0.585483
H  -4.506642 -1.939378 0.370306
H  -3.170301 -1.905325 -0.833588
H  -0.973531 -2.215864 1.0240
H  -4.198381 1.164154 -2.120643
H  -5.824281 -0.876925 -1.183396
H  3.172319 2.696688 -0.197677
H  5.073278 1.492354 -1.633593
H  5.5480 -0.030726 -0.804001
H  5.53659 1.517106 0.111482
