program: Gaussian 09
title: 000254692
version: EM64L-G09RevD.01
frameworkgroup: C1[X(C10H12IN5O5)]
method: RPBEPBE
basis: SDD
operation: Freq
keyword: #p
keyword: freq=noraman
keyword: PBEPBE/SDD
title: #p freq=noraman PBEPBE/SDD
converged: YES YES NO NO
title: Mulliken charges:
elementType: I O O O O O N N N N N C C C C C C C C C C H H H H H H H H H H H H
charge: 0.168979 -0.272963 -0.410421 -0.498286 -0.428085 -0.209736 -0.184175 -0.453594 0.051405 -0.054588 -0.624981 -0.062864 -0.156325 -0.170385 -0.044690 -0.345773 0.363409 -0.254383 -0.166045 0.014947 0.142885 0.221182 0.286754 0.282206 0.232057 0.216372 0.221193 0.345643 0.381078 0.386630 0.361002 0.308913 0.352641
chargesum: 0.00000
title: Mulliken charges with hydrogens summed into heavy atoms:
elementType: I O O O O O N N N N N C C C C C C C C C C
charge: 0.168979 -0.272963 -0.064778 -0.117208 -0.067082 -0.209736 -0.184175 -0.066965 0.051405 -0.054588 0.036572 0.158317 0.130428 0.111821 0.187367 0.091792 0.363409 -0.254383 -0.166045 0.014947 0.142885
polarizability: 2.32490479e+02 1.80454977e+01 2.16353348e+02 -7.14377869e+00 5.57525967e+00 1.04003000e+02
1716.lowfreq: -4.5526 -0.0003 0.0003 0.0005 4.9170 6.3390 27.6456 40.3833 49.7019
frequency: 27.5652 40.3564 49.6833 72.8055 76.2052 101.5957 107.5279 125.0822 128.2770 173.5771 183.1521 201.5581 206.0632 232.7221 264.4990 272.6927 288.4240 308.4921 310.5675 333.1663 338.4307 370.8972 384.5813 418.9758 424.3312 443.5566 464.0663 491.9381 513.7312 535.6619 539.9360 605.9236 622.1442 647.9957 656.3041 680.4002 693.3293 728.2273 771.3262 795.3786 806.1055 835.7638 845.5919 877.8630 918.2740 944.5165 953.9273 963.7839 987.2655 998.7433 1020.9061 1027.2800 1041.2825 1061.3621 1102.3775 1131.6755 1164.9184 1173.1889 1176.8489 1201.6412 1209.5776 1246.2538 1260.7472 1266.7052 1292.1918 1300.5806 1317.9197 1343.5269 1358.1353 1359.6100 1372.6545 1383.7661 1387.3672 1394.3527 1415.8719 1454.5986 1521.4660 1568.4908 1607.3845 1626.7322 1648.8712 2953.7695 2987.9970 3007.8103 3049.6426 3086.3822 3092.3228 3227.1775 3539.5549 3543.1841 3558.8671 3586.5028 3696.4290
redmass: 7.8117 7.3694 7.1262 7.3281 5.6570 6.4277 5.2251 9.0896 6.8382 4.0177 6.9159 8.4332 12.7679 6.7558 1.2186 3.5279 3.9463 2.7643 1.5725 6.1328 4.0493 1.4819 2.7120 1.8796 3.1273 4.4855 3.0772 9.3591 6.4058 1.1595 4.6421 8.0233 11.9928 6.4461 9.6212 6.3280 9.4961 3.9417 11.2274 5.4056 3.1779 2.0411 2.9576 2.4577 3.8353 4.4367 7.4075 3.2559 2.3655 5.0738 2.7190 3.2962 5.3893 5.4890 1.7973 3.9438 2.9064 1.5389 1.1439 1.2214 1.4696 4.1246 1.3198 1.4361 1.4286 1.4960 3.9747 1.2577 1.3225 1.7569 1.5864 1.3421 2.0677 3.9992 4.1416 1.0865 5.3594 2.9488 1.2480 10.5067 3.6464 1.0831 1.0844 1.0629 1.0880 1.0884 1.1016 1.0865 1.0665 1.0451 1.0661 1.0664 1.1047
irintensity: 2.5756 7.2441 0.2340 0.7432 2.3456 4.7444 1.7101 0.9956 0.6383 0.5567 0.8740 5.5455 4.7246 7.2985 56.9381 20.1179 9.3754 24.9080 78.1178 8.4029 2.5338 170.8250 67.4390 82.3618 32.5282 48.7294 16.9493 2.0897 5.3473 200.1069 8.6693 4.1593 0.9418 4.4676 4.6724 22.4401 8.7246 15.6608 16.5794 10.0186 19.5004 71.4332 60.1072 54.5059 34.9950 92.0839 81.4679 48.5415 51.4817 80.7091 92.8348 29.0611 29.1371 52.8334 26.4945 67.4597 11.0243 4.2840 22.6254 21.3228 26.4718 9.7262 8.7953 0.9628 16.5352 16.8836 123.5952 11.1074 51.6021 59.3753 32.1445 43.2335 89.0856 202.9082 4.1522 7.4217 292.0039 28.9244 89.9591 519.7311 434.9915 30.2465 14.2391 37.2096 28.1601 8.3449 24.8416 691.0488 12.4545 88.8556 14.0939 31.7527 47.8080
temp: 298.150 k
press: 1.00000 atm
elementType: 53 8 8 8 8 8 7 7 7 7 7 6 6 6 6 6 6 6 6 6 6 1 1 1 1 1 1 1 1 1 1 1 1
symmnumber: 1
zpe: 619252.3 jmol-1
zpe.correction: 0.235861 hartree
zpe.thermalcorrener: 0.256029 hartree
zpe.thermalcorrenthalpy: 0.256973 hartree
zpe.thermalcorrgfe: 0.185667 hartree
zpe.sumelectzpe: -1048.036542 hartree
zpe.sumelectthermal: -1048.016374 hartree
zpe.sumelectthermalent: -1048.015430 hartree
zpe.sumelectthermalfe: -1048.086736 hartree
dipole: 7.4052 -11.3322 -3.7992
dipole: 14.0602
quadrupole: -114.0605 -175.7388 -140.3317
quadrupole: 14.8563 -13.7946 4.4948
quadrupole: 29.3165 -32.3617 3.0453 14.8563 -13.7946 4.4948
hfenergy: -1048.2724032 hartree
pointgroup: C01 [X(C10H12I1N5O5)]
dipole: 5.1441215 1.0324088 -1.7527518 debye
polarizability: 208.080378|-11.418734|225.4469176|-1.2836212|-43.9758739|119.3195312 unknown
InChI: InChI=1S/C10H12IN5O5/c11-9-13-3-6(14-10(12)15-7(3)20)16(9)8-5(19)4(18)2(1-17)21-8/h2,4-5,8,14,17-19H,1,12H2
charge 0 multiplicity 1
33 atoms
I  -0.372054 -4.054638 1.564245
O  1.793256 -0.079568 1.100835
O  2.738987 -2.177382 -1.501169
O  1.891042 1.449385 -1.499033
O  3.650426 1.761985 2.397592
O  -4.700894 0.131805 0.231056
N  -0.190928 -1.165859 0.361235
N  -0.713281 1.13645 -0.483328
N  -2.341056 -1.812681 0.84083
N  -3.074581 1.700031 -0.432615
N  -1.486256 3.26463 -1.156067
C  1.257733 -1.195579 0.28986
C  1.896931 -1.039078 -1.144528
C  2.712556 0.290228 -1.073751
C  3.020021 0.433523 0.425946
C  3.285395 1.834105 0.984445
C  -1.039117 -0.104422 0.025962
C  -1.071002 -2.177841 0.871915
C  -2.352544 -0.502474 0.312843
C  -3.486702 0.410601 0.052072
C  -1.808857 2.007208 -0.669733
H  1.573184 -2.17009 0.714386
H  1.129935 -1.013805 -1.934046
H  3.622435 0.223494 -1.696387
H  3.878644 -0.222909 0.689736
H  2.3974 2.473079 0.817598
H  4.154535 2.286773 0.479371
H  3.405511 -2.358497 -0.788776
H  1.87884 1.498369 -2.487015
H  0.2538 1.380127 -0.772531
H  2.885663 1.379244 2.899461
H  -0.536397 3.628433 -1.14467
H  -2.268726 3.901556 -1.289037
