program: Gaussian 09
title: 000254682
version: EM64L-G09RevD.01
frameworkgroup: C1[X(C14H14Cl3N2OP)]
method: RPBEPBE
basis: SDD
operation: Freq
keyword: #p
keyword: freq=noraman
keyword: PBEPBE/SDD
title: #p freq=noraman PBEPBE/SDD
converged: YES YES NO NO
title: Mulliken charges:
elementType: Cl Cl Cl P O N N C C C C C C C C C C C C C C H H H H H H H H H H H H H H
charge: -0.197285 -0.051769 -0.046829 1.048314 -0.533640 -0.855575 -0.824062 0.565418 0.587575 0.523111 0.531925 -0.311611 -0.348766 -0.432462 -0.437638 -0.288995 -0.278858 -0.384308 -0.382502 -0.794314 -0.794007 0.368025 0.360993 0.286387 0.322155 0.230274 0.227924 0.238151 0.239111 0.248352 0.245334 0.221218 0.221469 0.248283 0.248603
chargesum: 0.00000
title: Mulliken charges with hydrogens summed into heavy atoms:
elementType: Cl Cl Cl P O N N C C C C C C C C C C C C C C
charge: -0.197285 -0.051769 -0.046829 1.048314 -0.533640 -0.487550 -0.463070 0.565418 0.587575 0.523111 0.531925 -0.025223 -0.026611 -0.202188 -0.209714 -0.288995 -0.278858 -0.146157 -0.143391 -0.079411 -0.075652
polarizability: 2.98899297e+02 -3.23981183e+01 2.47494227e+02 -1.06442888e+01 6.73251370e+00 1.72965673e+02
1716.lowfreq: -6.9827 -4.7215 -0.0027 -0.0023 0.0010 4.2208 12.9510 14.8864 15.9153
frequency: 12.8385 14.8128 15.6779 46.6240 64.1784 85.6969 101.3689 108.2532 117.3959 124.8786 144.5323 160.8092 169.8393 185.8149 198.9538 226.6946 238.9666 243.9550 250.9410 277.4373 325.0230 340.1852 353.3095 379.9766 409.9823 426.9183 432.6855 439.2374 441.7978 447.2413 511.7918 542.7256 557.9337 574.3621 585.4956 612.6913 664.4389 667.7903 700.7386 706.8853 741.1647 751.6527 807.2343 812.4263 813.3406 847.6437 861.5852 905.4925 907.9647 922.0027 941.8371 942.3200 994.5176 995.2395 1029.7456 1031.7340 1046.6893 1047.3548 1054.1583 1155.5098 1156.0745 1217.2061 1222.9496 1252.4115 1256.1719 1274.9434 1276.7103 1330.5267 1333.2020 1388.8038 1393.1945 1404.1453 1404.6465 1425.2637 1430.3575 1461.0380 1461.0899 1475.2252 1476.0077 1489.8831 1495.8250 1574.1391 1575.9428 1617.1846 1624.1241 2984.4540 2985.1414 3063.7220 3064.4489 3093.9205 3094.8498 3125.8782 3127.2281 3149.4774 3149.5877 3161.8590 3162.6986 3517.2286 3537.1642
redmass: 6.6156 8.6076 6.8962 7.3523 11.7344 7.8528 4.2200 1.3712 2.5837 1.1037 5.3996 5.1248 7.6544 7.8080 6.2666 6.7130 4.1729 4.7158 7.9569 6.3879 3.5008 3.9048 6.7236 8.4242 6.9221 6.9334 2.8747 4.0129 3.2165 4.2986 1.9728 2.6543 4.6324 2.5730 3.9439 1.8324 6.8622 7.2867 2.6421 2.8983 4.9831 4.7813 4.0559 1.4078 1.5051 3.8303 2.0253 3.3261 1.7643 5.3982 1.3568 1.3537 1.4641 1.4654 3.0668 3.1290 1.5172 1.5078 12.9031 1.3051 1.2893 1.7189 1.7866 3.3796 3.9019 1.3349 1.3109 2.7536 2.9193 3.1790 3.0794 1.2670 1.3401 2.0015 1.7827 1.0446 1.0445 1.1356 1.1533 3.0695 3.1719 5.6189 5.7143 7.1147 7.2012 1.0369 1.0369 1.0974 1.0973 1.0996 1.0998 1.0879 1.0876 1.0969 1.0968 1.0940 1.0930 1.0757 1.0761
irintensity: 0.2673 0.8720 0.7584 0.5245 1.6108 0.7877 0.4641 2.0962 1.1552 0.6019 0.5034 2.3978 2.9550 11.3248 12.0209 0.0495 1.0721 1.6606 13.2812 8.1787 1.6871 4.7392 17.0186 2.0358 35.6286 60.7222 16.1366 6.3483 21.5233 46.7446 40.5984 41.5615 21.5963 87.6190 0.3135 115.0424 8.8058 15.8121 2.4155 1.7845 15.2846 12.1835 32.9917 36.9174 31.4008 30.0976 63.8384 44.7936 86.9981 250.6973 1.4939 1.3384 16.2436 20.3209 34.4183 11.0998 8.6907 7.1044 90.4423 5.4945 6.2065 5.2019 24.9210 45.3017 19.3558 6.0278 2.9893 224.8020 35.4025 22.7220 5.4180 26.8144 21.2157 37.2871 48.9836 14.2739 14.0681 10.0362 28.2514 231.9820 135.8113 18.4942 39.1002 48.1934 105.9242 28.7348 23.7261 13.8301 12.6171 17.3612 17.9681 11.6739 11.1034 14.7482 15.0468 10.2481 3.0966 32.7648 48.5547
temp: 298.150 k
press: 1.00000 atm
elementType: 17 17 17 15 8 7 7 6 6 6 6 6 6 6 6 6 6 6 6 6 6 1 1 1 1 1 1 1 1 1 1 1 1 1 1
symmnumber: 1
zpe: 662463.3 jmol-1
zpe.correction: 0.252319 hartree
zpe.thermalcorrener: 0.274565 hartree
zpe.thermalcorrenthalpy: 0.275509 hartree
zpe.thermalcorrgfe: 0.196823 hartree
zpe.sumelectzpe: -2446.526833 hartree
zpe.sumelectthermal: -2446.504587 hartree
zpe.sumelectthermalent: -2446.503643 hartree
zpe.sumelectthermalfe: -2446.582329 hartree
dipole: -2.5549 -0.2253 5.9858
dipole: 6.5121
quadrupole: -128.7442 -159.0181 -152.9413
quadrupole: -11.9441 5.1543 2.8881
quadrupole: 18.1570 -12.1169 -6.0401 -11.9441 5.1543 2.8881
hfenergy: -2446.7791524 hartree
pointgroup: C01 [X(C14H14Cl3N2O1P1)]
dipole: 0.7413412 -1.7292999 1.738983 debye
polarizability: 294.4707291|-39.3617246|220.7197143|-6.7677274|36.2109108|204.1687536 unknown
InChI: InChI=1S/C14H14Cl2N2OP.Cl/c1-9-3-5-11(7-13(9)15)17-20(19)18-12-6-4-10(2)14(16)8-12;/h3-8,17-18H,1-2H3;
charge 0 multiplicity 1
35 atoms
Cl -0.625995 -2.755734 -3.639945
Cl 2.882722 2.173707 1.465148
Cl -4.568547 2.447419 -1.121293
P  -0.059142 -1.045399 -2.183198
O  -0.236177 0.404813 -2.807921
N  1.501106 -1.701159 -1.797392
N  -0.899787 -1.287956 -0.69523
C  2.484334 -1.107672 -0.950609
C  -2.145543 -0.739602 -0.273545
C  4.503116 -0.007501 0.780824
C  -4.622529 0.330433 0.709544
C  2.241344 0.102547 -0.254542
C  -2.683059 0.439478 -0.851643
C  3.732495 -1.762398 -0.791869
C  -2.841103 -1.386233 0.78035
C  3.245398 0.611953 0.58698
C  -3.899444 0.931698 -0.350585
C  4.711415 -1.211218 0.058375
C  -4.048702 -0.844535 1.260654
C  5.56934 0.567291 1.689285
C  -5.927146 0.892668 1.231622
H  1.811633 -2.458496 -2.412004
H  -0.552834 -2.083394 -0.149137
H  1.303551 0.652759 -0.373873
H  -2.161846 0.954051 -1.664114
H  3.935732 -2.697481 -1.32651
H  -2.438921 -2.304609 1.224242
H  5.67134 -1.72798 0.170218
H  -4.572951 -1.348198 2.080393
H  5.873862 1.578447 1.362167
H  5.202906 0.668244 2.727323
H  6.464368 -0.077021 1.698926
H  -6.323602 0.268951 2.050036
H  -5.796713 1.922871 1.610981
H  -6.68962 0.945357 0.433042
