program: Gaussian 09
title: 000254678
version: EM64L-G09RevD.01
frameworkgroup: C1[X(C8H11ClNO2P)]
method: RPBEPBE
basis: SDD
operation: Freq
keyword: #p
keyword: freq=noraman
keyword: PBEPBE/SDD
title: #p freq=noraman PBEPBE/SDD
converged: YES YES NO NO
title: Mulliken charges:
elementType: Cl P O O N C C C C C C C C H H H H H H H H H H H
charge: -0.225222 1.129643 -0.666259 -0.545343 -0.857622 0.327750 0.390535 0.469962 -0.567359 -0.374468 -0.393349 -0.843994 -0.809690 0.235713 0.289289 0.236574 0.391084 0.239459 0.229785 0.245713 0.224429 0.227436 0.238189 0.407747
chargesum: 0.00000
title: Mulliken charges with hydrogens summed into heavy atoms:
elementType: Cl P O O N C C C C C C C C
charge: -0.225222 1.129643 -0.258512 -0.545343 -0.466538 0.327750 0.390535 0.469962 -0.331646 -0.085179 -0.156775 -0.129037 -0.119637
polarizability: 2.14166822e+02 6.86621935e+00 1.31491867e+02 2.18684778e+00 2.46966224e+00 9.53574400e+01
1716.lowfreq: -7.2699 -5.4719 0.0019 0.0020 0.0026 8.4454 19.4660 28.8211 34.4652
frequency: 18.6826 28.4874 34.3961 93.2287 110.4540 172.3634 180.7176 187.7687 208.3038 217.8408 238.7999 258.8288 285.6894 313.7048 353.0414 356.5934 424.9684 441.5841 454.2918 507.2460 542.7648 559.8018 586.7848 707.2241 710.3881 727.1801 756.2119 837.1388 879.4044 888.7296 934.7895 971.3859 979.3288 1015.9689 1037.6247 1041.9063 1047.5429 1065.5428 1123.0277 1182.5687 1225.4516 1283.5914 1297.5732 1346.3074 1394.6667 1398.8473 1413.1000 1414.7736 1471.5167 1473.6985 1480.0544 1488.6714 1503.2332 1591.7288 1624.3945 2958.4522 2975.0145 3030.7244 3056.0699 3085.0589 3089.5630 3118.2392 3131.5322 3157.9754 3531.1163 3603.9076
redmass: 1.0603 6.2899 5.3161 5.1614 5.1967 1.6000 4.3919 2.9289 2.0239 4.3889 5.8958 10.4367 2.9516 1.9161 3.1831 3.3129 4.6439 2.8689 3.0634 5.1227 2.1336 4.5070 2.0049 5.5181 11.5831 3.5177 4.9657 1.3587 3.5733 1.3553 3.5701 1.3471 1.5247 1.4981 1.2496 1.5277 1.5656 8.1298 2.0684 1.5605 1.6854 5.1445 1.4221 2.6100 1.3900 1.2244 2.7896 1.7033 1.0865 1.0821 1.0600 1.2413 2.2555 5.9550 6.2393 1.0406 1.0388 1.0967 1.0949 1.0997 1.0956 1.0914 1.0894 1.0964 1.0750 1.0666
irintensity: 0.6645 0.4904 0.1091 0.4873 10.7024 8.3660 15.6518 0.7946 3.4532 11.2967 1.2588 15.5843 1.4615 41.8166 15.6171 106.0489 92.9448 14.3221 40.4800 0.4730 84.9462 12.7612 69.4906 5.7133 181.1127 19.3935 11.1154 49.7722 89.5627 4.5769 7.6209 2.6849 2.3497 7.2731 59.4235 2.1794 18.0848 112.9225 27.8005 4.4544 13.4353 19.7730 3.0466 32.0395 13.6467 9.8871 17.8851 23.5092 6.3257 11.5529 14.2772 24.0439 95.0297 0.2403 4.3761 27.6977 37.6389 17.6843 23.1057 16.6335 15.0590 23.7368 13.8667 2.6190 59.5873 117.7632
temp: 298.150 k
press: 1.00000 atm
elementType: 17 15 8 8 7 6 6 6 6 6 6 6 6 1 1 1 1 1 1 1 1 1 1 1
symmnumber: 1
zpe: 470297.3 jmol-1
zpe.correction: 0.179127 hartree
zpe.thermalcorrener: 0.194073 hartree
zpe.thermalcorrenthalpy: 0.195018 hartree
zpe.thermalcorrgfe: 0.134870 hartree
zpe.sumelectzpe: -1316.975686 hartree
zpe.sumelectthermal: -1316.960739 hartree
zpe.sumelectthermalent: -1316.959795 hartree
zpe.sumelectthermalfe: -1317.019942 hartree
dipole: -2.0958 3.2731 -0.9621
dipole: 4.0039
quadrupole: -77.7331 -89.7229 -99.2639
quadrupole: 5.4127 -6.9695 -1.6612
quadrupole: 11.1735 -0.8162 -10.3573 5.4127 -6.9695 -1.6612
hfenergy: -1317.1548123 hartree
pointgroup: C01 [X(C8H11Cl1N1O2P1)]
dipole: -0.8258054 -1.2068279 0.5857394 debye
dipolederiv: -0.7463162 0.0638783 0.2386116 0.243013 -0.374533 -0.2526572 0.7125173 -0.1442554 -0.8398037 2.4259106 -0.0384181 -0.1564573 0.2202046 1.4020655 0.0736832 -0.2093129 0.1563614 1.936037 -0.9723672 0.1261321 -0.3515848 0.245765 -0.6446353 0.0902228 -0.5840314 -0.0199647 -0.7421118 -0.6812331 -0.0071181 0.0083068 -0.1569042 -0.6129056 -0.0267348 -0.0571064 -0.0617136 -0.5593277 -1.1222225 0.0218835 -0.0730198 -0.5302876 -0.5158986 0.0693424 -0.2690354 -0.019769 -0.52884 -0.0834911 -0.0426642 0.0001644 0.0141309 0.2536132 -0.0836254 0.1012712 -0.0653076 -0.0368595 0.7953736 -0.0740147 0.1317476 -0.1792406 -0.0482526 0.0233586 0.2003929 0.0344777 0.044415 0.4059625 -0.0925372 0.0729732 -0.0313999 -0.0433989 -0.0227179 0.1707048 -0.0366133 -0.0015633 -0.0989723 0.0997073 0.0151753 0.2278889 -0.0357726 -0.0010504 -0.0403612 0.0066785 -0.1656342 -0.0320069 -0.0246763 0.0151989 0.0424101 -0.0512794 0.0221867 -0.0335042 -0.0111016 -0.1468792 -0.2830198 0.0411149 0.0353067 -0.1919646 0.1146736 -0.0271092 -0.0480275 -0.0309816 -0.14939 -0.0003606 0.0653941 -0.0078887 0.061448 -0.0805135 0.0158473 0.0036776 0.0326504 0.075564 -0.121832 0.0436766 -0.0366423 0.0572758 0.0665581 0.007279 -0.1725017 0.0342617 0.0454774 -0.0262106 -0.0974216 -0.0035519 -0.1174725 -0.0267505 0.00379 -0.0212382 0.0104432 0.1412926 0.0768568 -0.0715069 -0.0199769 -0.057451 0.0642642 0.0085427 0.0100592 -0.0009679 0.1517767 0.0493939 0.0612874 -0.0140644 0.078578 -0.0835895 0.0306732 -0.0117561 0.0333267 0.1443495 0.1134856 -0.0160399 0.0319416 0.0876787 0.2120643 0.0013759 0.0531446 0.036576 0.2792079 -0.0031995 0.0989029 0.0966465 0.0422756 0.027838 0.0042145 0.0999396 -0.0399373 0.0110917 0.0762196 0.0611396 -0.108141 0.0230989 0.0179692 0.0061088 -0.0853158 0.0699427 -0.0930538 -0.0567418 -0.1637774 -0.0132838 -0.0566753 0.0170162 -0.0011681 -0.0314205 -0.028732 0.1112059 -0.0459229 -0.0433511 0.0323436 -0.1312387 -0.023307 0.0775519 0.0938761 0.0600352 0.0696878 0.0184449 0.0179974 -0.0031558 0.1036421 -0.097835 -0.0775978 0.0558682 -0.0812221 0.0783152 -0.0225285 0.027103 -0.0344353 0.0218349 0.1081378 0.0044925 -0.0998041 0.0176709 -0.1230237 0.3347774 -0.0566916 0.143786 -0.01661 0.3544715 0.0539913 0.1619639 0.0481415 0.2980662 unknown
polarizability: 213.4480549|-9.0250294|131.8551502|-6.6739098|-1.9788925|95.7129234 unknown
InChI: InChI=1S/C8H11NO2P.Cl/c1-6-3-4-8(7(2)5-6)9-12(10)11;/h3-5,9-10H,1-2H3;
charge 0 multiplicity 1
24 atoms
Cl 3.39547 -0.386993 -1.926441
P  2.610761 0.45706 0.091673
O  3.682921 -0.353805 1.168791
O  2.55421 2.040122 0.065408
N  1.208212 -0.398609 0.570322
C  -1.110722 -1.126778 0.245314
C  -0.153713 -0.068629 0.287717
C  -2.889335 0.546709 -0.206881
C  -2.463511 -0.787208 0.012418
C  -0.554556 1.27515 0.082748
C  -1.908248 1.569855 -0.167537
C  -0.694186 -2.572268 0.45576
C  -4.344221 0.866871 -0.500123
H  -3.206997 -1.594166 -0.01014
H  0.186284 2.080175 0.123867
H  -2.205902 2.612864 -0.326951
H  1.397581 -1.342909 0.918918
H  0.08758 -2.884154 -0.264434
H  -0.304068 -2.753939 1.47821
H  -1.55305 -3.249507 0.319258
H  -5.022937 0.11266 -0.064714
H  -4.628902 1.855077 -0.097677
H  -4.535198 0.890985 -1.590838
H  4.641223 -0.292763 0.925731
