program: Gaussian 09
title: 000254658
version: EM64L-G09RevD.01
frameworkgroup: C1[X(C13H21N)]
method: RPBEPBE
basis: SDD
operation: Freq
keyword: #pfreq=noraman
keyword: PBEPBE/SDD
title: #p freq=noraman PBEPBE/SDD
converged: NO YES NO NO
title: Mulliken charges:
elementType: N C C C C C C C C C C C C C H H H H H H H H H H H H H H H H H H H H H
charge: -0.022418 0.313463 0.360229 -0.213958 -0.030735 -0.561121 -0.566821 -0.474761 -0.835363 -0.789958 -0.794561 -0.515954 -0.437781 -0.160646 0.242687 0.216188 0.235713 0.201030 0.221660 0.228553 0.233788 0.203264 0.223246 0.214569 0.216502 0.214376 0.233953 0.214079 0.235992 0.211835 0.213592 0.231901 0.230787 0.260791 0.245878
chargesum: 0.00000
title: Mulliken charges with hydrogens summed into heavy atoms:
elementType: N C C C C C C C C C C C C C
charge: -0.022418 0.313463 0.360229 0.028729 0.185452 -0.124378 -0.116607 -0.037708 -0.181045 -0.127549 -0.133141 -0.053267 0.068888 -0.160646
polarizability: 1.65315649e+02 -9.05599387e-01 1.20734665e+02 -6.39448049e+00 -7.25648501e-02 1.21911979e+02
1716.lowfreq: -50.4656 -22.2622 -14.3934 -0.0009 0.0003 0.0005 35.9168 63.8818 93.0098
frequency: 25.8416 63.2727 92.3964 106.5054 161.4811 176.8650 188.5764 204.1778 222.1697 245.4617 255.0477 282.7154 309.8255 343.7765 373.8499 380.1970 406.5841 431.2502 463.6433 498.7647 542.5342 568.2919 580.4050 632.2563 725.0163 752.6924 771.9216 813.0104 825.5112 867.3450 903.8011 914.3087 920.5679 931.3354 934.1461 953.5143 960.9383 988.0175 999.7366 1022.9754 1034.9563 1057.9145 1069.1152 1090.8673 1105.9286 1134.7369 1151.6597 1160.8587 1179.9796 1193.6999 1203.4161 1216.7170 1234.0776 1238.3675 1253.6558 1264.7505 1269.2312 1284.3059 1294.3972 1304.1386 1312.5885 1331.0375 1356.8370 1378.2444 1385.1758 1397.5795 1449.1877 1456.6489 1461.3324 1468.7277 1469.5926 1474.6816 1477.4782 1482.6067 1486.7087 1496.9090 1500.1996 2196.2172 2960.9615 2965.8853 2976.3375 2980.5495 2984.2123 2985.9073 2993.3413 2998.2411 3012.0141 3033.5823 3039.7210 3044.1419 3050.4470 3051.9693 3053.5789 3058.5270 3061.0182 3061.7044 3070.6010 3091.4206 3096.5990
redmass: 3.7671 4.0358 2.4028 2.0400 1.4132 1.1754 2.7104 1.1475 2.1592 2.6142 2.9418 2.6854 2.2220 2.1543 3.3409 2.6980 2.0560 2.4568 2.9298 2.7924 3.8908 3.7020 3.6730 3.3762 2.7468 1.6775 1.6760 1.4708 2.3970 2.3441 2.1720 2.0776 2.2640 1.6890 1.4854 1.9218 2.1682 1.4253 2.0514 2.0425 2.3458 1.7485 1.4528 1.7739 1.6470 2.0189 2.0344 1.7062 1.5792 1.6092 1.9039 2.1806 1.5409 1.6699 1.4769 1.9559 1.3756 1.2090 1.4472 1.5827 1.8431 1.3569 1.3621 1.2234 1.2372 1.1983 1.0788 1.0696 1.0618 1.0632 1.0686 1.0569 1.0750 1.0612 1.0640 1.0692 1.0675 12.4288 1.0798 1.0382 1.0379 1.0387 1.0591 1.0605 1.0592 1.0596 1.0640 1.1004 1.0981 1.0989 1.0970 1.0980 1.0990 1.0995 1.0980 1.1023 1.1025 1.0958 1.0954
irintensity: 2.7321 2.9517 3.5404 1.9762 0.7478 0.1135 0.5068 0.2624 0.0777 0.5170 0.1628 0.5354 0.4562 0.2522 0.5495 0.0509 0.2950 0.4519 0.3142 0.7538 4.3176 1.4697 2.8928 1.7176 0.9009 3.4171 4.8468 0.4912 0.4212 0.1813 0.5394 2.2873 1.1282 3.6943 3.0448 0.2782 1.2764 0.0697 0.4717 1.7674 2.8771 5.5090 1.0463 1.7406 3.3391 4.8382 2.9767 5.2625 0.9833 2.5125 1.7194 8.5224 1.1915 0.9446 3.6285 0.5564 5.6083 0.4758 0.7498 2.5371 3.4582 4.0594 2.7693 13.1075 14.8072 27.6785 5.1803 2.4698 5.9009 11.7481 10.8144 4.6815 10.3599 0.8182 6.5271 15.2081 13.0103 18.9143 15.2686 38.3450 19.6574 70.8407 1.4408 34.6594 22.1858 35.4248 50.8386 1.1226 28.6391 27.2768 7.7557 51.8818 4.1110 9.5566 78.9472 36.5712 87.7051 50.9133 28.0255
temp: 298.150 k
press: 1.00000 atm
elementType: 7 6 6 6 6 6 6 6 6 6 6 6 6 6 1 1 1 1 1 1 1 1 1 1 1 1 1 1 1 1 1 1 1 1 1
symmnumber: 1
zpe: 811881.7 jmol-1
zpe.correction: 0.309229 hartree
zpe.thermalcorrener: 0.324133 hartree
zpe.thermalcorrenthalpy: 0.325077 hartree
zpe.thermalcorrgfe: 0.267826 hartree
zpe.sumelectzpe: -561.614836 hartree
zpe.sumelectthermal: -561.599933 hartree
zpe.sumelectthermalent: -561.598988 hartree
zpe.sumelectthermalfe: -561.656239 hartree
dipole: -4.4848 0.0969 1.5066
dipole: 4.7321
quadrupole: -119.0092 -86.2919 -86.1118
quadrupole: 0.2481 6.7684 0.1008
quadrupole: -21.8716 10.8457 11.0258 0.2481 6.7684 0.1008
hfenergy: -561.9240654 hartree
pointgroup: C01 [X(C13H21N1)]
dipole: 1.7707436 -0.074492 -0.5701235 debye
polarizability: 165.4573654|-0.627414|120.792858|-5.9250164|0.3179296|121.7120698 unknown
InChI: InChI=1S/C13H21N/c1-12(2)10-6-7-13(12,3)11(9-10)5-4-8-14/h10-11H,4-7,9H2,1-3H3
charge 0 multiplicity 1
35 atoms
N  -5.22431 0.159961 0.320267
C  0.949345 0.704021 0.36613
C  2.1583 0.014105 -0.406855
C  1.568695 -1.429216 -0.214339
C  -0.280502 0.175684 -0.466303
C  0.138878 -1.301966 -0.822483
C  0.974101 -0.066671 1.728919
C  1.401328 -1.526028 1.332544
C  1.000786 2.228818 0.509551
C  2.314873 0.437893 -1.88946
C  3.538719 0.222791 0.26409
C  -1.661661 0.301318 0.212456
C  -2.808169 -0.000666 -0.796196
C  -4.147458 0.085645 -0.189344
H  2.169291 -2.245237 -0.652689
H  -0.327827 0.782468 -1.394871
H  0.140159 -1.4791 -1.913276
H  -0.547913 -2.044629 -0.372513
H  -0.003905 -0.032478 2.239359
H  1.701987 0.397232 2.41915
H  2.34541 -1.820055 1.824738
H  0.642422 -2.280283 1.609369
H  1.920855 2.549485 1.033032
H  0.977753 2.732553 -0.475798
H  0.14399 2.610338 1.096875
H  2.587576 1.5080 -1.963105
H  1.408657 0.281571 -2.497246
H  3.131374 -0.14092 -2.361444
H  3.543897 -0.005536 1.342183
H  3.876002 1.26947 0.141912
H  4.296069 -0.424623 -0.21751
H  -1.748028 -0.398692 1.063893
H  -1.804028 1.322435 0.615523
H  -2.678283 -1.014866 -1.22068
H  -2.758479 0.709976 -1.644381
