program: Gaussian 09
title: 000254689
version: EM64L-G09RevD.01
frameworkgroup: C1[X(C16H17BrN4O9)]
method: RPBEPBE
basis: SDD
operation: Freq
keyword: #p
keyword: freq=noraman
keyword: PBEPBE/SDD
title: #p freq=noraman PBEPBE/SDD
converged: YES YES NO NO
title: Mulliken charges:
elementType: Br O O O O O O O O O N N N N C C C C C C C C C C C C C C C C H H H H H H H H H H H H H H H H H
charge: 0.088967 -0.239370 -0.284503 -0.361042 -0.262730 -0.219421 -0.225841 -0.210773 -0.271167 -0.239955 -0.174430 -0.429491 0.055760 -0.411302 -0.154083 -0.035467 -0.094669 -0.118608 -0.356605 0.328055 -0.166287 -0.097428 0.309547 0.331333 0.155865 0.165332 -0.757944 0.326794 -0.779941 -0.764905 0.318904 0.322790 0.244750 0.318519 0.251135 0.264207 0.435924 0.366749 0.257119 0.260148 0.257745 0.259227 0.309229 0.253751 0.246728 0.283058 0.244324
chargesum: 0.00000
title: Mulliken charges with hydrogens summed into heavy atoms:
elementType: Br O O O O O O O O O N N N N C C C C C C C C C C C C C C C C
charge: 0.088967 -0.239370 -0.284503 -0.361042 -0.262730 -0.219421 -0.225841 -0.210773 -0.271167 -0.239955 -0.174430 0.006433 0.055760 -0.044553 0.164821 0.287324 0.150081 0.199911 0.158737 0.328055 -0.166287 -0.097428 0.309547 0.331333 0.155865 0.165332 0.017068 0.326794 0.042266 0.009205
polarizability: 2.86812057e+02 2.46500419e+00 2.90308102e+02 8.50545918e+00 7.25746601e+00 1.64110319e+02
1716.lowfreq: -43.8971 -4.7453 -3.2750 -0.0002 0.0002 0.0004 3.0940 17.7022 24.1935
frequency: -43.8953 17.6723 24.1639 30.3657 37.0611 43.1114 53.2867 58.2389 61.9781 70.2970 83.5953 90.1728 95.8639 107.6332 119.0855 121.1447 137.1748 140.4331 151.8612 164.1739 176.5831 187.3030 222.4364 225.8962 228.4847 252.5800 270.7283 283.5846 296.5101 333.0198 346.3455 357.9341 370.3381 386.7137 420.1480 438.7723 466.5663 484.2021 496.6924 511.1756 526.3836 564.3805 569.5064 575.1849 587.5814 611.9621 615.6288 626.9052 647.3873 648.8697 670.3999 692.7405 713.1096 730.4940 739.4215 771.9273 779.6656 783.4070 813.0651 824.2017 840.0450 854.2476 863.7938 904.1501 946.4517 959.2880 969.9521 972.7305 986.7110 997.8973 1000.3260 1010.2587 1025.2217 1032.7824 1044.5847 1046.9364 1048.2769 1049.3799 1083.6128 1095.7986 1104.8697 1156.7349 1163.7844 1171.8873 1186.8509 1194.3333 1229.0149 1252.5493 1260.4881 1274.4488 1279.4380 1294.9314 1301.7125 1316.2032 1340.1871 1356.8727 1359.8550 1362.3203 1383.9719 1387.6095 1391.3553 1402.7172 1422.5510 1438.2011 1452.1360 1453.5467 1455.5578 1455.8074 1456.8025 1458.3768 1472.1156 1547.3854 1585.6063 1662.2830 1663.0100 1667.6326 1676.3667 1681.4388 2987.8007 3005.8387 3011.8164 3041.7540 3045.6168 3061.9961 3072.5480 3085.7857 3091.9023 3099.1895 3101.1626 3124.8705 3129.0467 3143.7373 3143.9613 3244.6795 3526.0281
redmass: 1.0711 8.9847 7.6183 7.8120 7.7387 7.7985 7.1223 4.3239 7.4308 4.2262 4.3240 6.0925 5.0134 6.9352 2.0381 1.6832 7.0430 9.1696 1.3878 4.9000 4.8763 6.2185 8.7465 7.4407 7.5480 19.4690 7.4618 4.2161 3.5179 5.1857 6.5376 8.4897 7.0779 3.5140 5.0153 4.6917 4.8240 9.4683 7.8881 5.6623 4.7880 3.2355 3.3253 3.4950 6.5379 7.0413 5.8444 5.1481 5.2152 5.8288 6.0627 4.9792 5.2501 2.2060 3.8502 3.6498 4.9905 7.0310 5.1396 2.5495 2.1239 3.3088 3.9947 4.8325 5.8789 5.5101 3.9833 5.0160 3.2392 2.3165 2.2838 2.7674 4.6704 3.8050 2.1377 1.6667 1.6940 1.8985 2.2044 2.1301 7.4775 2.7732 5.3631 3.2355 2.4145 2.6882 1.2590 1.3387 3.4331 1.6153 7.1706 1.2512 1.2030 1.5317 2.4205 1.4441 1.6976 1.4771 1.2409 1.4246 1.2913 1.1929 7.0990 2.4990 1.0704 1.0695 1.0618 1.0547 1.0727 1.0558 1.0794 2.7954 9.4852 7.3035 9.3655 4.8513 8.9691 7.6996 1.0387 1.0381 1.0369 1.0816 1.0606 1.0861 1.0979 1.0877 1.0874 1.0971 1.0946 1.1085 1.0998 1.1012 1.1021 1.0863 1.0770
irintensity: 1.6881 0.1463 0.3284 2.0080 0.6303 0.0428 1.4907 2.3551 2.3733 2.4425 3.6896 0.2698 1.4194 1.3551 0.8619 0.0876 0.8677 0.7798 0.7028 4.4682 4.0737 2.8213 5.6504 10.3537 6.0485 0.8121 6.2344 6.3867 15.5909 3.9421 1.2442 26.9814 12.9133 18.8478 1.5432 8.1414 15.2383 19.0491 5.0123 7.7131 10.3712 1.8068 6.8484 2.5933 13.5010 19.0050 2.5641 4.8831 7.1281 31.5348 16.0129 5.7047 4.4946 15.0046 49.6944 55.6102 31.8660 24.9790 43.8342 26.1373 71.4556 18.7411 108.4520 61.6108 118.6746 49.6107 26.4556 22.6474 74.4982 57.2487 109.3156 55.0453 158.2822 23.9361 2.5034 24.1737 11.5635 8.7467 4.0789 29.9384 88.8148 173.5885 60.7606 302.7728 250.6725 141.0336 26.2108 3.3281 63.3404 35.8642 78.6397 1.3360 3.2772 19.1761 50.9235 14.1624 33.5770 0.6977 65.6580 10.9400 72.4388 39.8744 8.3284 207.5533 27.0079 2.0141 14.4149 23.2508 43.5947 21.6429 51.9738 85.1515 16.9528 104.2274 167.9232 681.0181 484.6650 355.4169 21.3926 2.7387 0.3353 7.4910 12.4240 9.3851 15.4166 3.0478 4.1007 2.3494 4.7569 4.8136 2.6926 5.3743 7.3066 946.3661 74.5790
temp: 298.150 k
press: 1.00000 atm
elementType: 35 8 8 8 8 8 8 8 8 8 7 7 7 7 6 6 6 6 6 6 6 6 6 6 6 6 6 6 6 6 1 1 1 1 1 1 1 1 1 1 1 1 1 1 1 1 1
symmnumber: 1
zpe: 880611.1 jmol-1
zpe.correction: 0.335407 hartree
zpe.thermalcorrener: 0.364374 hartree
zpe.thermalcorrenthalpy: 0.365318 hartree
zpe.thermalcorrgfe: 0.271892 hartree
zpe.sumelectzpe: -1527.203682 hartree
zpe.sumelectthermal: -1527.174715 hartree
zpe.sumelectthermalent: -1527.173771 hartree
zpe.sumelectthermalfe: -1527.267197 hartree
dipole: 7.7787 -4.4181 3.2786
dipole: 9.5277
quadrupole: -217.3583 -169.7437 -191.7090
quadrupole: -0.3563 2.7618 -3.3802
quadrupole: -24.4213 23.1933 1.2280 -0.3563 2.7618 -3.3802
hfenergy: -1527.5390886 hartree
pointgroup: C01 [X(C16H17Br1N4O9)]
dipole: -3.5646123 0.5549172 1.0182106 debye
polarizability: 285.7053917|0.8301123|275.451831|0.608313|-43.6150728|180.0732558 unknown
InChI: InChI=1S/C16H17BrN4O9/c1-5(22)27-4-8-10(28-6(2)23)11(29-7(3)24)14(30-8)21-12-9(18-15(21)17)13(25)20-16(26)19-12/h8,10-11,14,19-20H,4H2,1-3H3
charge 0 multiplicity 1
47 atoms
Br 1.550825 4.188347 -1.98536
O  -0.228759 0.294766 -1.744882
O  -1.710065 2.156654 0.637432
O  -0.470135 -1.298404 0.908222
O  -3.869872 -0.576765 -1.219484
O  -1.87349 1.639095 2.905484
O  -2.303984 -2.71878 1.115917
O  6.120554 0.672619 -0.23601
O  3.08473 -2.59232 1.231655
O  -3.476231 -2.450083 -2.552888
N  1.520194 1.539964 -0.712267
N  2.194118 -0.635529 0.318362
N  3.623274 2.389749 -1.08531
N  4.542461 -0.91086 0.4711
C  -0.685844 1.09217 0.5104
C  -1.363285 -0.280852 0.293102
C  0.07101 1.406557 -0.816578
C  -1.404228 -0.457543 -1.237259
C  -2.707395 0.085905 -1.863283
C  2.440164 0.591154 -0.255402
C  2.328012 2.607419 -1.22087
C  3.720708 1.121421 -0.481323
C  -2.239799 2.34191 1.942754
C  -1.093818 -2.519567 1.327683
C  4.910215 0.363886 -0.111652
C  3.272375 -1.456534 0.708483
C  -3.247904 3.462724 1.957691
C  -4.125449 -1.906129 -1.634957
C  -0.111394 -3.409002 2.036904
C  -5.214797 -2.517988 -0.793872
H  -0.051147 1.08441 1.412987
H  -2.359233 -0.358581 0.756115
H  -0.303613 2.361902 -1.22505
H  -1.256308 -1.505107 -1.543241
H  -2.850959 1.157939 -1.657062
H  -2.706774 -0.111167 -2.948172
H  1.241714 -1.002778 0.506329
H  5.330466 -1.504491 0.750067
H  -3.384441 3.897743 0.957867
H  -2.911137 4.245423 2.659526
H  -4.212813 3.081601 2.334206
H  -0.088876 -3.132383 3.108203
H  0.916914 -3.298245 1.651009
H  -0.445567 -4.454743 1.961528
H  -5.647335 -3.385471 -1.313293
H  -4.761404 -2.857901 0.155753
H  -5.99668 -1.779936 -0.555565
