program: Gaussian 09
title: 000254654
version: EM64L-G09RevD.01
frameworkgroup: C1[X(C10H12N4)]
method: RPBEPBE
basis: SDD
operation: Freq
keyword: #pfreq=noraman
keyword: PBEPBE/SDD
title: #p freq=noraman PBEPBE/SDD
converged: YES YES NO NO
title: Mulliken charges:
elementType: N N N N C C C C C C C C C C H H H H H H H H H H H H
charge: -0.136381 -0.158800 -0.622017 -0.622978 0.490335 -0.399176 -0.386113 -0.326562 -0.233763 -0.234123 -0.247248 -0.218431 -0.284265 0.263244 0.226030 0.223214 0.215275 0.224043 0.222348 0.227006 0.232449 0.232392 0.336899 0.310778 0.304233 0.361608
chargesum: 0.00000
title: Mulliken charges with hydrogens summed into heavy atoms:
elementType: N N N N C C C C C C C C C C
charge: -0.136381 -0.158800 0.025660 0.042863 0.490335 -0.173145 -0.162898 -0.111287 -0.009720 -0.011776 -0.020241 0.014018 -0.051872 0.263244
polarizability: 4.29804981e+02 -1.00967592e+01 1.33167767e+02 4.89438499e-01 6.35480908e-02 5.54863595e+01
1716.lowfreq: -5.5555 -0.0001 0.0001 0.0007 4.1718 11.6570 34.7313 47.5504 49.9426
frequency: 34.6558 47.5299 49.9324 101.0644 134.1234 148.6564 204.9898 212.3555 221.9068 295.3525 322.5958 388.4653 402.3771 404.7421 420.9519 440.6344 513.9982 519.4723 536.6594 607.3393 616.1780 640.0724 655.3797 694.3442 730.2269 765.9145 836.5280 841.9886 873.0570 920.2178 928.6714 937.2353 974.6790 985.2592 986.0299 996.6373 1006.1096 1024.8961 1049.1168 1080.1272 1114.2647 1170.7556 1188.7215 1190.2469 1231.3334 1258.3762 1293.9975 1319.1238 1345.3596 1386.1508 1439.3860 1477.5314 1491.1440 1509.4628 1564.7119 1579.2039 1585.2231 1608.1239 1622.4253 1631.3846 3034.9771 3083.8112 3116.3429 3118.0021 3123.9072 3136.8640 3146.7447 3163.2993 3470.3391 3556.2268 3675.6139 3708.6868
redmass: 4.1079 4.8297 4.7879 4.5199 1.7530 3.8709 2.0669 2.4649 4.3428 4.1798 3.0428 2.1437 1.9751 2.8110 2.2175 4.0161 1.8838 1.5223 3.8896 4.3804 5.9728 3.4584 3.9571 1.6836 1.4648 1.7547 4.5191 1.2965 1.5699 1.6128 4.9772 1.5160 1.3904 1.2193 6.0977 1.2283 1.8282 2.1665 1.8942 1.6732 3.2670 1.0726 1.2608 1.6015 1.5883 1.6688 1.6407 1.6398 1.5561 6.0953 2.3933 2.3690 2.1143 3.1259 3.7357 4.3642 1.9633 5.5404 1.6511 4.0114 1.0889 1.0896 1.0865 1.0885 1.0863 1.0914 1.0958 1.1014 1.0498 1.0451 1.0981 1.1044
irintensity: 2.5731 2.1515 1.1444 5.3340 59.8801 13.1136 20.0453 33.8848 13.8334 10.1537 1.3075 176.8800 141.1696 0.4895 84.4596 14.0188 16.4191 87.2708 15.9580 5.2729 0.2074 10.4074 11.9700 46.6725 143.4626 63.9346 0.6173 0.0338 0.0457 1.3559 101.8290 0.8029 0.0145 50.3720 2.2141 45.7802 2.4068 8.9187 0.7316 15.4830 206.4369 1.1020 1.2121 5.3760 5.1384 41.9190 3.2580 19.6309 18.2830 11.2563 11.1560 364.5059 264.7353 384.0705 144.5879 4.5473 601.5191 30.8760 564.1898 186.2132 26.2163 18.5416 6.0823 28.9615 1.8899 10.4740 46.7065 41.5411 29.1809 139.6273 84.0177 39.0265
temp: 298.150 k
press: 1.00000 atm
elementType: 7 7 7 7 6 6 6 6 6 6 6 6 6 6 1 1 1 1 1 1 1 1 1 1 1 1
symmnumber: 1
zpe: 543656.2 jmol-1
zpe.correction: 0.207068 hartree
zpe.thermalcorrener: 0.220741 hartree
zpe.thermalcorrenthalpy: 0.221686 hartree
zpe.thermalcorrgfe: 0.165584 hartree
zpe.sumelectzpe: -606.228872 hartree
zpe.sumelectthermal: -606.215198 hartree
zpe.sumelectthermalent: -606.214254 hartree
zpe.sumelectthermalfe: -606.270355 hartree
dipole: -4.0648 1.7019 0.0704
dipole: 4.4073
quadrupole: -37.3847 -70.2434 -90.9804
quadrupole: -8.3907 -0.8123 -0.5369
quadrupole: 28.8182 -4.0406 -24.7776 -8.3907 -0.8123 -0.5369
hfenergy: -606.4359396 hartree
pointgroup: C01 [X(C10H12N4)]
dipole: -1.5725808 0.0571437 -0.7282416 debye
dipolederiv: 1.5221642 0.0392241 0.1655835 0.122233 -0.1695443 0.0282931 -0.4599511 0.0074492 -0.3782814 -2.9605347 -0.0474516 -0.3702117 0.0117519 -0.2764013 0.0042318 -0.432987 0.0105707 -0.465763 -2.2391589 -0.1814611 0.1560914 -0.4763637 -0.7148291 -0.1005932 0.3504574 -0.0890931 -0.3603396 -0.5113722 0.0702086 -0.0042132 0.2853518 -0.6764977 0.2052596 -0.8832616 0.1127974 -1.1828083 0.7335739 0.0221175 -0.0023822 0.0399502 0.0651404 0.0130737 -0.1719191 0.0077197 -0.0729064 -0.3772357 -0.001429 -0.0471328 -0.0040686 -0.1900702 -0.0297715 -0.0337263 -0.0290692 0.0991688 -0.2252187 -0.0069993 0.0550382 -0.0229157 -0.1641283 -0.0119141 0.2161269 -0.0064369 -0.0202569 -0.3636109 0.000467 -0.0596702 0.0216761 -0.1908458 -0.0381363 -0.2607445 -0.0442663 0.1711675 0.2074859 0.0031065 0.087436 -0.0015902 -0.1452185 -0.0154044 0.1390735 -0.0138461 0.0458504 -0.0237083 0.006504 -0.0257056 0.0199513 -0.1454523 -0.0280752 -0.1690927 -0.0325665 0.1344144 -0.1724995 0.0049875 -0.0485165 -0.0079842 -0.1829154 -0.0121002 0.0903134 -0.0076079 -0.0728134 0.4622466 0.0170035 0.0463815 0.0251048 -0.1652145 -0.015503 -0.0479969 -0.0189527 0.0199379 -0.4862865 -0.0078664 -0.0348613 0.0190389 -0.081884 -0.0375972 -0.4149836 -0.0520423 0.2807586 3.3755145 0.1409137 0.1008572 -0.0400808 0.2587541 -0.1581703 1.7589657 -0.1370362 1.4825043 0.0865252 -0.0098459 0.0787923 -0.00554 0.1524522 0.0275499 0.0343453 0.0257791 -0.1035024 0.0065124 0.0060103 -0.1121638 0.0034647 0.1451398 0.0104082 -0.0829696 0.0113167 -0.0013094 0.0282044 -0.005671 0.0127694 -0.0120597 0.1542047 0.0272918 0.0792668 0.0289735 -0.1148768 -0.0777302 0.0028774 -0.1106751 0.0066358 0.1573528 0.0133487 -0.148364 0.0121036 -0.0192986 0.0459873 -0.0076639 0.0429699 -0.0140081 0.1533904 0.0279366 0.1089117 0.0299472 -0.1204349 -0.1453251 -0.0155365 0.0570942 -0.0169842 0.1643389 0.0108771 0.0701913 0.0112845 0.071208 0.0708076 -0.0041149 0.0132836 -0.0141366 0.1571329 0.0246807 0.094329 0.0270089 -0.0846367 0.0155357 -0.004961 -0.0096683 -0.011288 0.1735119 0.0306176 0.0601765 0.0330184 -0.1347201 0.2805781 0.0195833 -0.0422516 0.0670963 0.3881635 0.0161971 -0.1322482 0.0266092 0.1847815 0.2675127 0.0230964 -0.0181266 0.184533 0.3793036 0.0764352 0.0646179 0.0726385 0.1690863 0.1874521 -0.0440848 -0.0115084 -0.1199109 0.4045636 -0.0411267 0.0032595 0.0147899 0.1958781 0.2925801 -0.0190146 0.0807899 -0.059857 0.3495525 -0.0278089 0.1682098 -0.0010893 0.2771922 unknown
polarizability: 428.1786806|10.1618306|56.7186829|22.6224114|-7.9462097|133.5617437 unknown
InChI: InChI=1S/C10H12N4/c11-10(12)14-13-8-4-7-9-5-2-1-3-6-9/h1-8H,11-12H2
charge 0 multiplicity 1
26 atoms
N  -2.564909 -0.016747 -0.103929
N  -3.796666 -0.12642 0.575332
N  -6.098676 -0.217594 0.209966
N  -4.659294 0.159493 -1.648585
C  2.356561 0.095928 0.442045
C  3.412476 0.039295 1.40038
C  2.714249 0.238849 -0.933419
C  0.969189 0.004435 0.909824
C  4.764198 0.120651 1.007923
C  4.064288 0.320049 -1.325043
C  5.099563 0.261578 -0.358932
C  -0.172436 0.041464 0.138672
C  -1.502531 -0.058875 0.690883
C  -4.823942 -0.058401 -0.29974
H  3.15977 -0.070546 2.462636
H  1.930793 0.285919 -1.697892
H  0.842316 -0.105914 1.997783
H  5.555479 0.07415 1.764771
H  4.315961 0.429579 -2.386331
H  6.148616 0.325109 -0.668506
H  -0.115248 0.150359 -0.95227
H  -1.628918 -0.171433 1.782096
H  -6.166877 -0.376882 1.212633
H  -6.929927 0.028393 -0.318943
H  -5.402161 0.053593 -2.332025
H  -3.676476 0.237066 -1.928524
