program: Gaussian 09
title: 000254648
version: EM64L-G09RevD.01
frameworkgroup: C1[X(C4H5N3O5S)]
method: RPBEPBE
basis: SDD
operation: Freq
keyword: #p
keyword: freq=noraman
keyword: PBEPBE/SDD
title: #p freq=noraman PBEPBE/SDD
converged: YES YES NO NO
title: Mulliken charges:
elementType: S O O O O O N N N C C C C H H H H H
charge: 1.038824 -0.519067 -0.492254 -0.461346 -0.264102 -0.126112 -0.112475 -0.014641 0.093989 -0.050371 0.177172 -0.169096 -0.586590 0.282986 0.296151 0.273783 0.230052 0.403096
chargesum: 0.00000
title: Mulliken charges with hydrogens summed into heavy atoms:
elementType: S O O O O O N N N C C C C
charge: 1.038824 -0.115972 -0.492254 -0.461346 -0.264102 -0.126112 -0.112475 -0.014641 0.093989 -0.050371 0.177172 0.113890 0.213397
polarizability: 1.38570010e+02 -2.39359356e+00 1.24960007e+02 2.50999067e+00 -1.21193999e-01 6.62415705e+01
1716.lowfreq: -12.5303 -7.3571 -4.2202 -0.0014 -0.0014 0.0017 31.5657 68.5838 84.3809
frequency: 31.4912 68.5751 84.3758 116.3738 127.2703 174.3063 207.2657 215.1351 230.6264 268.3285 277.4144 311.5078 347.2782 372.9941 395.1503 450.8360 540.5461 572.6209 614.7564 623.1163 632.1044 682.6419 720.6050 764.0364 814.6920 840.4467 948.9496 970.3146 1040.4512 1073.4047 1122.2330 1150.4993 1204.6869 1228.3356 1279.9204 1296.3261 1344.4974 1386.4422 1417.6271 1432.4529 1456.2124 1468.9880 1483.7761 3025.5492 3127.4519 3129.8120 3143.2469 3247.2765
redmass: 9.6841 14.4834 3.9021 1.1749 6.6462 8.3000 11.8568 5.5193 9.2358 5.9640 6.0197 7.3645 11.2172 5.6790 8.9814 8.7027 7.7873 5.8446 9.1859 1.3101 3.6661 6.6589 12.9526 12.6394 1.4341 16.9786 8.3776 11.8624 2.8925 2.8043 1.3336 3.0946 1.4110 1.8705 6.7861 3.6564 7.0937 11.6026 2.3615 6.2437 1.0405 1.4363 1.2111 1.0331 1.1012 1.0677 1.1037 1.1000
irintensity: 3.1270 0.9747 2.7479 0.0761 0.6542 6.1822 7.1281 5.8289 0.7399 1.5324 5.1665 6.9541 8.2132 3.1948 21.4019 44.0595 11.1814 38.5125 15.5101 232.0696 24.1968 7.7615 0.7669 48.8307 20.6688 97.7732 2.8169 84.9454 11.6918 1.5534 1.2023 154.9326 43.7569 156.1977 30.0307 2.3455 31.4300 114.9870 2.7005 61.4391 25.2600 27.1952 42.9031 10.4685 15.2524 219.0866 3.2596 1.2574
temp: 298.150 k
press: 1.00000 atm
elementType: 16 8 8 8 8 8 7 7 7 6 6 6 6 1 1 1 1 1
symmnumber: 1
zpe: 283891.5 jmol-1
zpe.correction: 0.108129 hartree
zpe.thermalcorrener: 0.121143 hartree
zpe.thermalcorrenthalpy: 0.122087 hartree
zpe.thermalcorrgfe: 0.067803 hartree
zpe.sumelectzpe: -1092.575023 hartree
zpe.sumelectthermal: -1092.562009 hartree
zpe.sumelectthermalent: -1092.561065 hartree
zpe.sumelectthermalfe: -1092.615349 hartree
dipole: -1.8731 6.7272 -0.5946
dipole: 7.0084
quadrupole: -100.8903 -73.2540 -86.3879
quadrupole: -10.3218 -2.0863 1.6155
quadrupole: -14.0463 13.5901 0.4562 -10.3218 -2.0863 1.6155
hfenergy: -1092.6831519 hartree
pointgroup: C01[X(C4H5N3O5S1)]
dipole: -0.9938612 -2.5713419 0.0561939 debye
dipolederiv: 1.6686265 -0.2285922 0.0902689 -0.3014218 1.6936803 0.003999 0.1375241 -0.0497162 1.4457983 -0.6787542 -0.0685003 -0.2708359 0.0029774 -0.6918556 -0.1036038 -0.1349171 -0.1340117 -0.6044901 -0.6734332 0.074709 0.0092582 -0.0178623 -0.5260732 0.0344358 0.0820561 0.048625 -0.4408036 -0.4970656 0.0396447 0.0590779 0.1164624 -0.5400894 0.0416781 -0.0481011 0.1202956 -0.5708383 -0.5613129 0.1139912 0.0219821 0.0475184 -0.8337418 -0.1377846 0.096759 -0.1291778 -0.2441534 -0.9132214 0.069498 0.0322859 0.0125803 -0.3539278 -0.0336078 0.0261515 -0.0396552 -0.1738515 -0.4745343 0.0504392 -0.0289377 -0.5138607 -0.257012 -0.0177863 -0.0335514 -0.0017508 -0.0593904 -0.3640615 0.0168168 -0.0194782 0.302354 -0.4367989 0.0068655 0.0329467 -0.0113558 -0.1702062 1.6155305 0.1158411 -0.0307678 0.3794097 1.1940946 0.1929981 -0.0199235 0.1362631 0.2279804 0.2198011 0.2993463 0.0522825 0.3993309 -0.1213095 0.0226255 0.0120997 0.042015 -0.1670977 -0.4178347 -0.4489385 -0.0283391 -0.364861 -0.1164658 -0.0467542 -0.0446271 -0.0192269 0.0745474 0.0439826 -0.0116171 0.0097915 -0.0418632 0.1739377 0.003759 -0.0050899 0.0037013 -0.0420632 0.3074385 0.1288562 0.029135 0.1045733 0.2009215 0.0093901 0.0350794 0.0003574 0.1423004 0.0871097 -0.0422538 -0.006724 -0.0309775 0.0551947 -0.0051958 -0.008388 -0.0068159 0.1839915 0.0463828 -0.0329904 0.0100219 0.037874 0.1325164 -0.070182 0.0207607 -0.0444154 0.0308792 0.0345076 -0.0387801 -0.0151747 0.0169612 0.0890932 0.0796978 -0.0396455 0.0519249 -0.0075258 0.0881577 0.0764213 -0.0053988 -0.0442123 -0.1006735 -0.0011173 -0.0111567 -0.005724 0.1354544 0.4686808 -0.1138914 0.0915521 -0.1049827 0.4385092 0.020583 -0.0979768 0.0386675 0.2394685 unknown
polarizability: 138.9832775|1.0298048|124.4468114|0.543923|3.2724063|66.3414985 unknown
InChI: InChI=1S/C4H5N3O5S/c1-6-2-5-3(7(8)9)4(6)13(10,11)12/h2,10H,1H3
charge 0 multiplicity 1
18 atoms
S  -1.457459 1.234508 -0.059754
O  -0.841123 2.194611 1.334773
O  -2.949286 0.788761 0.353458
O  -1.156591 1.949916 -1.470173
O  1.657904 1.803966 0.38713
O  3.295266 0.259073 0.04027
N  -0.863519 -1.592542 -0.031463
N  1.404613 -1.79694 0.060059
N  2.068944 0.577016 0.178841
C  -0.34644 -0.301095 0.050816
C  1.05369 -0.458167 0.095066
C  0.235339 -2.456134 -0.016135
C  -2.277676 -2.024133 -0.123458
H  0.126909 -3.537139 -0.057189
H  -2.850839 -1.640596 0.732631
H  -2.738164 -1.643964 -1.048855
H  -2.291351 -3.124736 -0.130654
H  0.154484 2.311394 1.140538
