program: Gaussian 09
title: 000254644
version: EM64L-G09RevD.01
frameworkgroup: C1[X(C17H14N2)]
method: RPBEPBE
basis: SDD
operation: Freq
keyword: #pfreq=noraman
keyword: PBEPBE/SDD
title: #p freq=noraman PBEPBE/SDD
converged: YES YES NO NO
title: Mulliken charges:
elementType: N N C C C C C C C C C C C C C C C C C H H H H H H H H H H H H H H
charge: -0.038109 -0.688304 0.430567 -0.188235 0.408371 -0.415957 -0.324176 -0.429759 0.535826 -0.254682 -0.344944 -0.325637 -0.387531 -0.407170 -0.185280 -0.387164 0.487658 -0.425286 -0.432257 0.225776 0.273582 0.232510 0.223907 0.209245 0.241017 0.232907 0.222815 0.227378 0.238049 0.215623 0.215286 0.306514 0.307457
chargesum: 0.00000
title: Mulliken charges with hydrogens summed into heavy atoms:
elementType: N N C C C C C C C C C C C C C C C C C
charge: -0.038109 -0.074332 0.430567 -0.188235 0.408371 -0.190180 -0.050594 -0.197249 0.535826 -0.030775 -0.135699 -0.084621 -0.154624 -0.184355 0.042099 -0.149115 0.487658 -0.209663 -0.216970
polarizability: 4.89924527e+02 -8.19108021e+00 2.28705052e+02 1.77589442e-02 3.32170417e-02 7.60036739e+01
1716.lowfreq: -2.0926 -0.0010 -0.0001 0.0009 5.9417 13.1328 29.4813 45.0315 51.8920
frequency: 29.2292 45.0301 51.8894 83.2025 164.2334 172.6984 178.0912 191.9190 200.4733 273.8340 347.0357 355.1655 372.7273 384.6603 403.9881 411.2177 430.6916 467.7932 469.3748 479.1392 514.9862 531.1460 536.1116 572.5423 619.4480 638.8606 649.6431 719.7125 736.3188 761.8218 798.6032 801.6096 807.7247 813.4590 827.6373 846.9826 852.2906 878.0443 894.3331 906.1779 938.4114 948.8271 959.7491 977.4578 987.6139 996.9016 1011.6089 1016.9870 1022.0591 1034.8510 1081.6463 1131.2699 1138.5965 1180.7063 1190.3761 1214.8304 1233.9145 1234.7579 1265.6685 1296.5479 1300.5402 1325.3303 1334.4560 1346.6508 1376.6080 1388.6557 1400.5029 1418.5149 1447.4841 1455.0199 1493.3379 1521.3955 1555.9598 1567.6451 1587.0150 1606.0889 1622.9894 1636.1627 1647.1732 3076.7139 3109.9940 3116.8231 3117.0958 3120.9287 3127.1469 3133.8910 3134.6082 3137.4443 3150.4125 3155.5452 3163.2748 3563.4293 3704.0287
redmass: 3.6544 5.1474 5.1889 4.6626 4.1785 4.1208 5.3084 2.7215 6.4465 3.0509 3.4388 2.0091 1.7478 1.0267 3.7020 2.8945 4.0089 4.8235 3.1031 7.3925 2.3784 5.8752 6.3888 3.3779 7.1508 6.7780 2.8928 6.1760 3.1750 1.3134 5.5066 1.7672 4.7625 1.2886 1.6421 2.6340 5.4467 4.6627 1.5613 1.7369 1.4571 1.4832 1.3694 1.3475 1.3856 2.7820 1.1275 1.4750 3.7969 2.4658 2.1466 1.2759 1.3099 1.2355 1.1119 2.0108 1.6964 2.0865 1.7659 1.4116 2.0051 3.3609 1.3299 3.8334 2.2010 3.8738 2.8595 2.4531 3.8426 2.8929 3.8161 3.1554 6.0850 6.2768 5.4990 6.2139 5.2439 1.5621 2.6503 1.0891 1.0866 1.0880 1.0885 1.0858 1.0905 1.0957 1.0911 1.0893 1.0948 1.0988 1.0991 1.0448 1.1040
irintensity: 0.0141 4.1507 1.5169 0.0089 0.0245 5.5079 0.1349 1.3472 0.4471 3.8148 4.6623 94.5552 220.3690 5.1990 0.6752 0.0338 1.8113 0.7568 0.1305 27.6616 20.8492 4.6816 8.9061 0.2015 8.6715 0.1403 0.0610 0.4329 0.0107 12.7038 4.5454 91.4376 8.8947 0.0049 27.1397 76.5124 0.6832 0.8955 0.7843 4.5556 0.4920 0.2780 0.8419 0.5744 0.7824 0.2549 52.6705 1.1135 8.2171 2.9497 16.8681 11.8430 2.8224 5.1967 113.5628 2.4509 28.7345 2.9646 12.8506 0.3373 16.6499 155.8691 15.6292 2.0241 11.8401 44.6627 13.5695 13.0297 7.8903 28.9662 20.3463 138.1275 209.1549 6.6003 5.8780 88.9789 409.1943 105.2268 230.1935 17.3380 15.2784 24.9653 24.8141 1.7931 12.2575 60.0930 20.6287 5.5308 13.9493 41.4483 43.6600 179.2028 21.0968
temp: 298.150 k
press: 1.00000 atm
elementType: 7 7 6 6 6 6 6 6 6 6 6 6 6 6 6 6 6 6 6 1 1 1 1 1 1 1 1 1 1 1 1 1 1
symmnumber: 1
zpe: 687407.1 jmol-1
zpe.correction: 0.261820 hartree
zpe.thermalcorrener: 0.277244 hartree
zpe.thermalcorrenthalpy: 0.278188 hartree
zpe.thermalcorrgfe: 0.218242 hartree
zpe.sumelectzpe: -764.422422 hartree
zpe.sumelectthermal: -764.406997 hartree
zpe.sumelectthermalent: -764.406053 hartree
zpe.sumelectthermalfe: -764.465999 hartree
dipole: 2.1717 -0.0839 0.0054
dipole: 2.1733
quadrupole: -58.5786 -94.0191 -120.9239
quadrupole: -3.4122 0.0361 0.0023
quadrupole: 32.5953 -2.8452 -29.7501 -3.4122 0.0361 0.0023
hfenergy: -764.6842415 hartree
pointgroup: C01 [X(C17H14N2)]
dipole: -0.8550469 -0.0025189 0.0004922 debye
polarizability: 490.1745458|-1.3350669|213.3661176|-0.4532665|-45.5234611|91.0925899 unknown
InChI: InChI=1S/C17H14N2/c18-16-10-7-13(8-11-16)6-9-15-4-1-3-14-5-2-12-19-17(14)15/h1-12H,18H2
charge 0 multiplicity 1
33 atoms
N  2.114889 -1.616263 0.530028
N  -6.618201 -0.611424 0.216587
C  1.400295 0.603961 -0.202504
C  2.465123 -0.339926 0.106971
C  3.853351 0.060242 -0.028873
C  1.779457 1.89677 -0.630849
C  0.010328 0.165896 -0.054506
C  4.173156 1.383196 -0.467069
C  -2.50442 0.493107 -0.157843
C  3.141789 2.281669 -0.761623
C  -1.111056 0.921061 -0.30227
C  4.862722 -0.907881 0.288532
C  -2.890391 -0.811517 0.278275
C  -3.554576 1.409435 -0.462376
C  4.49123 -2.184411 0.711251
C  3.096811 -2.490804 0.816681
C  -5.278132 -0.246611 0.09277
C  -4.238048 -1.176381 0.401944
C  -4.909442 1.059168 -0.343722
H  1.004778 2.632675 -0.87182
H  -0.086239 -0.8702 0.288145
H  5.22428 1.678768 -0.567171
H  3.380237 3.297073 -1.097818
H  -0.987993 1.959486 -0.646168
H  5.918937 -0.628874 0.193729
H  -2.120316 -1.550597 0.524138
H  -3.293707 2.420744 -0.800125
H  5.23669 -2.946021 0.960651
H  2.776684 -3.486904 1.146511
H  -4.501765 -2.18662 0.73974
H  -5.689727 1.790933 -0.586986
H  -7.360181 0.0471 -0.001627
H  -6.877761 -1.543851 0.524893
