program: Gaussian 09
title: 000018127
version: EM64L-G09RevD.01
frameworkgroup: C1[X(C10H14ClOPS2)]
method: RPBEPBE
basis: SDD
operation: Freq
keyword: #p
keyword: freq=noraman
keyword: PBEPBE/SDD
title: #p freq=noraman PBEPBE/SDD
converged: YES YES NO NO
title: Mulliken charges:
elementType: Cl S S P O C C C C C C C C C C H H H H H H H H H H H H H H
charge: -0.050511 -0.002454 -0.208190 0.458049 -0.448925 -0.622564 -0.618335 -0.214695 -0.178921 -0.655371 -0.209872 -0.175626 -0.193978 -0.194109 -0.091262 0.288430 0.256309 0.230390 0.235641 0.249005 0.202363 0.225952 0.206053 0.236997 0.234100 0.251962 0.270341 0.258708 0.260513
chargesum: 0.00000
title: Mulliken charges with hydrogens summed into heavy atoms:
elementType: Cl S S P O C C C C C C C C C C
charge: -0.050511 -0.002454 -0.208190 0.458049 -0.448925 -0.077825 0.096701 0.213621 -0.178921 0.021779 0.042090 0.094715 0.064730 0.066404 -0.091262
polarizability: 2.71197329e+02 2.35795728e+00 1.77029464e+02 -1.34277098e+01 1.51339713e+01 1.36503822e+02
1716.lowfreq: -2.9426 -0.0029 -0.0022 -0.0013 7.3088 9.5930 17.7355 30.8814 43.5536
frequency: 15.7565 30.6798 43.5058 48.5508 69.1284 82.0862 91.8902 109.8547 123.1383 144.8310 175.8043 199.5900 211.0134 236.0285 245.7443 257.9631 292.4170 312.1710 325.6618 339.1399 349.9147 410.1517 428.3050 486.7975 507.8045 536.1362 618.6202 638.5572 673.1054 695.9113 716.6528 780.8208 814.0895 819.8172 823.1035 869.6735 947.1912 961.6381 989.2671 992.0174 1016.3495 1040.8651 1050.1819 1064.7308 1071.1308 1101.2289 1102.5173 1128.2528 1180.8905 1241.5556 1256.8992 1274.8929 1283.2417 1352.5216 1359.9146 1381.3640 1394.5794 1398.7731 1426.2401 1453.2395 1456.8103 1467.7562 1477.6469 1483.2890 1489.1317 1571.9736 1574.9815 2956.1865 2993.3175 2995.0827 3017.2040 3020.2919 3082.8066 3090.3675 3092.1386 3106.3224 3110.3570 3154.0376 3163.9651 3176.6756 3183.5265
redmass: 5.7199 6.2556 4.7319 2.9576 2.2943 2.9789 4.3930 6.4846 4.9017 6.5077 1.8393 3.9023 9.0980 2.9869 1.7605 1.4907 4.0554 10.2358 5.9869 8.4889 4.0874 2.8863 6.2029 3.2119 8.5512 7.2966 7.1668 5.7027 6.0762 3.9545 7.2852 1.2315 1.0997 1.2751 1.4137 3.7752 1.3326 1.3712 4.6217 1.8771 2.5677 1.3073 2.2693 6.5391 1.9664 1.3879 2.1365 1.4291 1.1175 1.1993 1.1447 1.3037 1.2362 1.2571 4.3159 4.3996 1.2335 1.1808 1.0815 2.1687 1.0399 1.0369 1.0542 1.0487 1.0758 6.4775 7.6904 1.0563 1.0355 1.0365 1.0643 1.1021 1.1015 1.0995 1.0982 1.1018 1.1016 1.0891 1.0889 1.0969 1.0979
irintensity: 0.6301 0.5349 0.5539 0.4734 1.9633 1.5409 0.1548 2.9082 0.9099 0.1316 0.8924 16.9448 3.9495 5.6775 2.0032 3.8833 3.2589 1.1306 0.8988 3.1098 1.0267 0.2888 70.2978 23.0448 15.0850 55.5150 0.5749 61.3934 29.8436 0.4789 9.3783 23.1990 3.5248 9.8338 54.3907 131.7981 0.8550 0.5491 84.4026 1.2363 102.4344 3.3458 41.4698 10.4091 39.1347 9.9195 7.2223 7.5426 3.0277 2.1652 3.2150 2.2813 1.2611 7.2199 0.5353 11.1299 21.3832 20.7280 9.7402 73.3034 12.0718 16.9365 3.2932 15.8477 2.9051 27.6384 7.3203 48.2258 29.9420 26.6927 8.9911 17.1655 2.0617 13.8445 25.4790 17.6963 27.5826 1.7399 1.4075 4.3106 0.6405
temp: 298.150 k
press: 1.00000 atm
elementType: 17 16 16 15 8 6 6 6 6 6 6 6 6 6 6 1 1 1 1 1 1 1 1 1 1 1 1 1 1
symmnumber: 1
zpe: 572160.5 jmol-1
zpe.correction: 0.217924 hartree
zpe.thermalcorrener: 0.236520 hartree
zpe.thermalcorrenthalpy: 0.237464 hartree
zpe.thermalcorrgfe: 0.167891 hartree
zpe.sumelectzpe: -2060.957418 hartree
zpe.sumelectthermal: -2060.938823 hartree
zpe.sumelectthermalent: -2060.937879 hartree
zpe.sumelectthermalfe: -2061.007452 hartree
dipole: -3.9364 2.0240 2.7045
dipole: 5.1872
quadrupole: -110.2936 -109.1027 -128.7893
quadrupole: -2.2922 -4.3778 -2.9713
quadrupole: 5.7682 6.9592 -12.7274 -2.2922 -4.3778 -2.9713
hfenergy: -2061.1753429 hartree
pointgroup: C01 [X(C10H14Cl1O1P1S2)]
dipole: -1.5176681 -0.6066972 -1.2220475 debye
polarizability: 271.0999024|-2.39365|169.1014379|13.5334112|22.2888593|144.5292747 unknown
InChI: InChI=1S/C6H4ClS.C4H10OPS/c7-5-1-3-6(8)4-2-5;1-3-5-6(7)4-2/h1-4H;3-4H2,1-2H3
charge 0 multiplicity 1
29 atoms
Cl 5.408883 0.021143 0.887816
S  -0.513096 0.353978 -1.653944
S  -1.099686 1.629363 1.86785
P  -1.867695 0.559574 0.284594
O  -2.269606 -1.078048 0.781303
C  -3.435589 1.237862 -0.515325
C  -4.609829 1.288898 0.479766
C  -2.70251 -2.071624 -0.239726
C  1.144046 0.255554 -0.877867
C  -2.690409 -3.429326 0.458908
C  1.830483 -0.983013 -0.852249
C  1.753115 1.420513 -0.351624
C  3.135386 -1.059034 -0.318317
C  3.054614 1.351212 0.194747
C  3.725118 0.113236 0.196993
H  -3.169615 2.242412 -0.887328
H  -3.659371 0.597693 -1.38841
H  -5.506627 1.690588 -0.025483
H  -4.85345 0.286879 0.874119
H  -4.373199 1.941989 1.337517
H  -3.720363 -1.81236 -0.597799
H  -2.000703 -2.041826 -1.096938
H  -3.016526 -4.21933 -0.243101
H  -1.675221 -3.669555 0.816608
H  -3.371846 -3.427397 1.326326
H  1.350013 -1.882603 -1.248931
H  1.216414 2.372804 -0.363777
H  3.676545 -2.009098 -0.299709
H  3.531226 2.243815 0.608883
