program: Gaussian 09
title: 000254627
version: EM64L-G09RevD.01
frameworkgroup: C1[X(C14H13NO2)]
method: RPBEPBE
basis: SDD
operation: Freq
keyword: #p
keyword: freq=noraman
keyword: PBEPBE/SDD
title: #p freq=noraman PBEPBE/SDD
converged: YES YES NO NO
title: Mulliken charges:
elementType: O O N C C C C C C C C C C C C C C H H H H H H H H H H H H H
charge: -0.217233 -0.252978 -0.019875 -0.517423 0.303463 -0.424030 -0.505244 0.119697 0.259281 0.053602 -0.004509 -0.505909 -0.382410 -0.464645 -0.379544 0.339866 -0.536490 0.227992 0.233249 0.220728 0.216811 0.229856 0.253381 0.289822 0.231863 0.288662 0.243307 0.223251 0.252274 0.223186
chargesum: 0.00000
title: Mulliken charges with hydrogens summed into heavy atoms:
elementType: O O N C C C C C C C C C C C C C C
charge: -0.217233 -0.252978 -0.019875 -0.056183 0.303463 0.013509 -0.022006 0.119697 0.259281 0.053602 -0.004509 -0.216087 -0.150547 -0.175984 -0.136237 0.339866 0.162221
polarizability: 2.95411664e+02 1.60367733e+01 1.62326479e+02 1.17111769e+00 -2.80090984e+00 8.14345913e+01
1716.lowfreq: -8.3426 -3.5670 -2.3680 -0.0007 0.0003 0.0007 46.7115 62.7114 90.0077
frequency: 46.6845 62.7012 89.9987 105.0204 147.2045 182.7661 206.8917 222.3059 247.9223 281.8833 283.3367 322.0554 373.1870 407.3277 431.1301 446.2633 502.5031 511.1646 528.2756 534.8462 561.2851 576.0970 609.2846 652.3779 700.6963 705.4715 752.8021 784.6545 814.8195 850.7357 857.5878 883.7218 899.2715 908.5824 931.1326 946.9979 966.1899 993.1439 1016.2292 1054.7602 1092.5816 1108.6721 1110.9988 1132.3252 1143.2274 1165.6830 1182.8231 1189.1632 1230.2896 1246.8308 1266.2549 1282.6242 1315.6332 1318.7731 1344.0885 1354.8954 1373.7743 1384.4551 1426.1649 1437.7922 1438.6302 1451.6374 1452.3040 1468.6810 1470.5753 1474.6215 1503.3644 1545.8344 1567.2272 1588.3993 1629.2146 2957.8100 2964.4487 2968.3119 2994.2853 3037.1230 3055.3276 3055.6978 3069.7423 3129.7045 3141.8245 3143.4115 3167.7239 3185.4883
redmass: 4.4222 3.9826 4.0192 2.7841 4.2989 3.4438 2.6169 1.3428 4.2460 2.3095 6.5563 5.5803 5.3229 4.1631 3.2558 3.3648 4.1486 4.2075 4.1861 5.0240 3.6497 4.0666 4.5392 3.9157 3.5738 5.9343 4.0195 1.9693 2.1853 3.7983 1.9529 2.5172 1.6337 3.5553 2.9360 1.3745 1.4339 3.7448 3.1303 2.0738 1.9281 1.2584 2.9437 1.2981 1.5002 2.1420 1.6286 1.4207 2.2338 1.3620 2.2089 2.1447 1.7152 1.3915 2.3431 2.0543 2.0777 3.9461 2.2316 1.4541 1.3805 1.8751 1.4480 1.0507 1.0989 1.0905 3.3706 8.4108 6.9038 10.2277 6.9402 1.0667 1.0329 1.0669 1.0616 1.0916 1.1043 1.1018 1.0949 1.0994 1.0870 1.0916 1.0955 1.0927
irintensity: 0.3401 0.5975 5.8994 1.6679 0.2256 0.0947 0.4664 0.4494 11.0862 1.1441 0.8636 4.7857 1.9161 2.1588 7.9411 1.7108 2.4476 1.6601 26.5487 7.9735 4.0799 0.7840 1.6286 3.5354 5.8551 2.3954 18.8718 17.5829 22.3960 4.0851 4.3663 12.5743 27.1521 12.5535 1.2710 0.3014 13.5465 35.2997 54.9984 0.3914 6.5352 0.1658 20.2056 46.6983 11.3721 170.9919 4.2607 30.0895 127.0563 11.9452 78.2950 92.9700 8.0481 25.7593 4.7269 62.3009 31.1664 4.2047 122.9707 2.2286 12.4684 45.8208 10.3201 14.5724 44.9710 15.8244 53.5742 155.2448 74.2733 272.1727 181.3276 13.3761 82.9695 10.7428 37.4006 25.6802 42.7364 46.1684 22.5377 24.4058 5.0472 1.7166 16.0197 2.1655
temp: 298.150 k
press: 1.00000 atm
elementType: 8 8 7 6 6 6 6 6 6 6 6 6 6 6 6 6 6 1 1 1 1 1 1 1 1 1 1 1 1 1
symmnumber: 1
zpe: 621865.2 jmol-1
zpe.correction: 0.236856 hartree
zpe.thermalcorrener: 0.250920 hartree
zpe.thermalcorrenthalpy: 0.251865 hartree
zpe.thermalcorrgfe: 0.195857 hartree
zpe.sumelectzpe: -745.285206 hartree
zpe.sumelectthermal: -745.271142 hartree
zpe.sumelectthermalent: -745.270198 hartree
zpe.sumelectthermalfe: -745.326205 hartree
dipole: 3.6099 7.2016 -0.3762
dipole: 8.0645
quadrupole: -90.2686 -100.9036 -100.0949
quadrupole: -3.6266 -0.0247 -0.3829
quadrupole: 6.8204 -3.8146 -3.0058 -3.6266 -0.0247 -0.3829
hfenergy: -745.5220624 hartree
pointgroup: C01 [X(C14H13N1O2)]
dipole: -1.4220909 -2.8320592 -0.15461 debye
polarizability: 295.4458649|15.9076286|162.2970485|-0.2675341|2.8864948|81.4298204 unknown
InChI: InChI=1S/C14H13NO2/c1-17-9-5-6-11-10-3-2-4-14(16)12(10)8-15-13(11)7-9/h5-8H,2-4H2,1H3
charge 0 multiplicity 1
30 atoms
O  4.124627 1.505864 -0.022339
O  -4.51414 0.451227 0.011489
N  -0.02323 2.082684 0.082205
C  1.69837 -1.98552 -0.064566
C  1.084441 -0.593791 -0.024835
C  3.150049 -2.003912 0.46369
C  4.003763 -0.92331 -0.232254
C  1.907365 0.553977 -0.00035
C  -0.343256 -0.397745 -0.019733
C  3.395942 0.469355 -0.069543
C  -0.858674 0.961051 0.038667
C  1.29599 1.859297 0.058378
C  -1.291272 -1.468643 -0.076022
C  -2.258973 1.191886 0.05017
C  -2.667754 -1.230631 -0.071124
C  -3.15731 0.115116 -0.003676
C  -5.500295 -0.632803 -0.053337
H  1.082408 -2.692447 0.520522
H  1.682972 -2.354357 -1.112606
H  3.145905 -1.821468 1.555923
H  3.594441 -3.00334 0.302735
H  4.065176 -1.140076 -1.320121
H  5.03935 -0.896116 0.148395
H  1.954833 2.734357 0.081274
H  -0.939536 -2.503754 -0.134453
H  -2.624487 2.220315 0.097951
H  -3.361004 -2.075366 -0.119774
H  -5.403554 -1.210037 -0.992864
H  -6.476723 -0.127993 -0.029087
H  -5.411523 -1.311917 0.816284
