program: Gaussian 09
title: 000018101
version: EM64L-G09RevD.01
frameworkgroup: C1[X(C12H8Cl2)]
method: RPBEPBE
basis: SDD
operation: Freq
keyword: #pfreq=noraman
keyword: PBEPBE/SDD
title: #p freq=noraman PBEPBE/SDD
converged: YES YES NO NO
title: Mulliken charges:
elementType: Cl Cl C C C C C C C C C C C C H H H H H H H H
charge: -0.064149 -0.053417 0.355698 0.368492 -0.376953 -0.375193 -0.354798 -0.403857 -0.219990 -0.220238 -0.101938 -0.212960 -0.106825 -0.243243 0.244947 0.246624 0.265863 0.243936 0.256585 0.257075 0.234066 0.260274
chargesum: 0.00000
title: Mulliken charges with hydrogens summed into heavy atoms:
elementType: Cl Cl C C C C C C C C C C C C
charge: -0.064149 -0.053417 0.355698 0.368492 -0.132006 -0.128570 -0.088935 -0.159921 0.036596 0.036837 -0.101938 0.021107 -0.106825 0.017031
polarizability: 2.53569803e+02 -4.37996129e+00 1.42933290e+02 -3.12180664e+00 -5.75163764e+00 6.28358776e+01
1716.lowfreq: -5.2611 -4.4057 0.0024 0.0025 0.0032 1.2865 47.7443 57.5772 83.7082
frequency: 47.7326 57.5744 83.7049 151.9795 186.2439 213.9304 252.3042 286.9953 325.7113 377.2822 409.9333 422.8294 445.8508 455.5511 504.8295 574.1076 625.2957 641.7509 686.7089 691.7878 717.0777 777.7517 788.1625 827.0926 831.6586 887.6253 905.1637 950.5558 962.4188 976.8781 982.9546 995.9296 1024.8029 1075.5397 1079.6200 1095.8145 1113.7826 1181.0233 1194.2038 1274.9829 1297.1168 1298.9639 1344.5571 1369.9261 1400.5549 1420.9947 1456.5898 1493.4276 1562.5880 1581.7083 1600.9729 1606.8753 3137.4586 3141.8382 3143.6171 3157.4405 3163.4854 3171.0865 3174.4319 3178.3367
redmass: 6.0931 5.8105 7.4125 7.4730 5.4265 8.1910 8.3605 6.4660 4.9646 8.6883 2.9146 3.9452 3.7921 7.4211 3.4632 4.2025 7.1371 7.1236 7.7329 2.3360 3.2202 6.4859 1.4137 1.2538 1.5302 1.4815 1.3924 1.3506 1.3866 1.4636 4.3656 4.6971 4.5616 2.1308 2.2963 1.6124 1.3680 1.0891 1.1335 1.7569 1.2669 1.7784 3.3835 10.6787 4.2511 2.9471 2.1800 2.8810 6.1058 7.6683 6.2013 6.7031 1.0871 1.0890 1.0889 1.0936 1.0922 1.0956 1.0968 1.0978
irintensity: 0.1288 0.1442 0.3699 0.5776 0.0977 0.4591 1.0600 0.9240 0.2600 7.7841 0.7309 6.7327 4.7195 15.6914 12.9985 8.4404 0.5565 5.5517 11.9876 18.4447 2.0850 66.9752 82.0567 1.9946 50.5033 9.8160 0.4216 0.1763 1.4405 0.7793 4.9608 32.5144 27.1455 40.7411 22.8421 5.0669 6.9276 0.0410 0.2413 8.7240 1.9017 0.2483 5.7346 0.8946 5.0823 11.5770 114.2028 30.3097 38.6051 17.1629 15.0809 36.8676 10.3675 5.9408 4.9244 11.8325 0.7878 6.9801 0.7000 5.6635
temp: 298.150 k
press: 1.00000 atm
elementType: 17 17 6 6 6 6 6 6 6 6 6 6 6 6 1 1 1 1 1 1 1 1
symmnumber: 1
zpe: 417419.6 jmol-1
zpe.correction: 0.158987 hartree
zpe.thermalcorrener: 0.170667 hartree
zpe.thermalcorrenthalpy: 0.171611 hartree
zpe.thermalcorrgfe: 0.119653 hartree
zpe.sumelectzpe: -1381.242052 hartree
zpe.sumelectthermal: -1381.230373 hartree
zpe.sumelectthermalent: -1381.229428 hartree
zpe.sumelectthermalfe: -1381.281386 hartree
dipole: -0.5671 1.9295 0.3118
dipole: 2.0351
quadrupole: -105.5293 -84.7774 -98.5009
quadrupole: -5.3062 -1.6884 -2.5893
quadrupole: -9.2601 11.4918 -2.2317 -5.3062 -1.6884 -2.5893
hfenergy: -1381.4010391 hartree
pointgroup: C01 [X(C12H8Cl2)]
dipole: -0.2687429 0.7394745 0.1484931 debye
dipolederiv: -0.472962 -0.3031506 -0.0637582 -0.4401542 -0.5331065 -0.0979553 -0.0934058 -0.0958882 -0.0958203 -1.0085297 0.0851052 0.0138861 0.1001008 -0.1257488 0.0195294 0.0164247 0.0179009 -0.0769917 0.2332753 -0.0184063 -0.0018528 -0.0535465 -0.0673282 -0.0031653 -0.0030262 0.0261324 -0.00961 0.4786925 -0.0465796 -0.0042504 0.0007479 0.0875869 0.0396282 0.0085786 0.0079979 0.0161318 -0.0435202 -0.0364889 0.0143862 0.0445549 0.0214682 -0.0851932 0.035772 -0.0780222 -0.103428 -0.0396532 0.0350421 -0.0374243 -0.0275108 0.0136767 -0.0802943 -0.0536181 -0.0669628 -0.0997527 -0.4116457 -0.1373937 -0.0339106 -0.1957197 -0.1668091 0.0062205 -0.0861245 -0.0019024 -0.1136414 -0.2510387 0.0707412 0.0273212 0.1215886 -0.0469052 0.0419724 0.0671296 0.0332305 -0.1501384 -0.3376957 0.0995337 -0.032292 0.1565831 -0.0272624 -0.0386403 -0.0746759 -0.0398805 -0.081523 -0.3781989 -0.0327789 0.0295662 -0.0832726 0.0116248 -0.0419032 0.0735245 -0.0516303 -0.0846126 0.6782642 0.4886075 0.1000067 0.704117 0.7889816 0.176511 0.179221 0.1719066 -0.0109635 0.1289122 0.00194 0.0025047 -0.0790104 0.1237968 0.0523855 -0.0485076 0.0587282 -0.1204449 1.3580735 -0.128727 -0.0256761 -0.1411024 0.1035774 -0.0600511 -0.0292147 -0.0631591 -0.0436646 -0.2064043 -0.1019051 -0.0217262 -0.1520659 -0.2783847 -0.0388664 -0.0348536 -0.0298642 -0.1344746 0.058118 0.0847082 -0.0299951 0.0746511 -0.011666 0.0694467 -0.0378329 0.056642 0.1165432 0.0243778 -0.0833916 0.0477743 -0.0808106 0.0219538 0.0612215 0.0517536 0.0518181 0.1151541 0.0996577 0.061626 0.0134021 0.0694798 0.0035747 -0.0372502 0.0257771 -0.0279772 0.1436637 0.0333547 -0.1048632 -0.0270925 -0.0980114 0.0014383 -0.0400444 -0.0349468 -0.0302091 0.1398172 0.0247034 -0.0614118 0.0338731 -0.0654826 0.0361653 0.0574652 0.0325271 0.059678 0.1379669 0.0513982 0.0555294 -0.0177513 0.0633912 0.0106136 0.0609041 -0.0156346 0.062207 0.1398595 0.0284971 0.0562998 0.0108786 0.0791551 -0.0737304 -0.0475757 0.0152681 -0.0492215 0.1468924 -0.0476763 0.0159637 0.0021303 0.0023174 0.1064831 -0.014345 0.0058646 -0.0115241 0.169037 unknown
polarizability: 253.7393986|2.2394891|143.1388937|-0.5746982|-2.7827533|62.4606789 unknown
InChI: InChI=1S/C12H8Cl2/c13-11-6-4-9(5-7-11)10-2-1-3-12(14)8-10/h1-8H
charge 0 multiplicity 1
22 atoms
Cl -4.158639 -2.08672 -0.437799
Cl 5.273521 -0.398694 -0.051417
C  0.649653 0.120756 0.021813
C  -0.831129 0.29126 0.047928
C  1.496581 1.162629 -0.447553
C  1.258325 -1.085425 0.466039
C  -1.688946 -0.822148 -0.172479
C  -1.420747 1.562469 0.293185
C  2.899074 1.014458 -0.473413
C  2.658802 -1.252213 0.446886
C  -3.081697 -0.641333 -0.141172
C  -2.822356 1.717618 0.315889
C  3.461826 -0.195572 -0.023804
C  -3.676919 0.611948 0.098238
H  1.057692 2.0913 -0.827849
H  0.637701 -1.895711 0.863493
H  -1.273749 -1.808434 -0.399361
H  -0.779562 2.426049 0.498832
H  3.539388 1.818864 -0.846252
H  3.115643 -2.180653 0.801033
H  -3.260139 2.701552 0.514779
H  -4.764721 0.7211 0.115485
