program: Gaussian 09
title: 000254615
version: EM64L-G09RevD.01
frameworkgroup: C1[X(C11H15NO)]
method: RPBEPBE
basis: SDD
operation: Freq
keyword: #p
keyword: freq=noraman
keyword: PBEPBE/SDD
title: #p freq=noraman PBEPBE/SDD
converged: YES YES NO NO
title: Mulliken charges:
elementType: O N C C C C C C C C C C C H H H H H H H H H H H H H H H
charge: -0.262636 -0.242732 -0.008274 -0.373561 -0.362899 -0.371308 0.424209 -0.685576 -0.378132 -0.368963 -0.223911 -0.230499 -0.270210 0.234293 0.227212 0.231486 0.235781 0.206322 0.225340 0.209866 0.205302 0.240340 0.217569 0.233611 0.224948 0.218592 0.218678 0.225154
chargesum: 0.00000
title: Mulliken charges with hydrogens summed into heavy atoms:
elementType: O N C C C C C C C C C C C
charge: -0.262636 -0.242732 0.226018 0.085137 0.079204 0.063898 0.424209 -0.022365 -0.144521 -0.144016 -0.005319 -0.011821 -0.045056
polarizability: 1.71649159e+02 7.03397422e+00 1.33134116e+02 -9.90011571e-02 -8.34264072e+00 7.56511235e+01
1716.lowfreq: -18.4108 -7.8694 -0.0002 0.0003 0.0006 7.1476 55.1788 61.6502 82.2544
frequency: 55.1091 61.6076 82.2459 129.9660 167.3899 190.8284 208.6203 231.7096 262.4566 307.9951 369.9831 413.8961 450.0773 497.5733 512.0310 612.6867 641.6049 656.6633 691.6611 743.8015 750.7876 806.2953 817.7651 852.3263 863.7077 883.1977 900.0220 954.0310 957.2877 972.4693 974.4918 983.1655 1013.7746 1032.7508 1056.3740 1078.4424 1094.9488 1102.0489 1126.4611 1169.4039 1171.1212 1178.2117 1197.2089 1212.0480 1247.8112 1274.0016 1308.3061 1324.3611 1334.1774 1339.0784 1351.3173 1366.2883 1385.6136 1386.4957 1450.3771 1460.1799 1473.5345 1477.8928 1487.7931 1490.8471 1501.8886 1577.0832 1623.1753 2946.9410 2974.2709 2978.4184 2980.9099 2994.1343 3015.9912 3042.8569 3074.9440 3091.3234 3103.8076 3121.9730 3128.0675 3149.5475 3154.1758 3168.1927
redmass: 3.9777 3.1650 2.8540 2.6183 2.7589 1.5252 3.2784 1.5551 3.3201 4.4139 4.8499 2.9472 3.2396 3.0468 3.0978 6.2357 3.8213 3.9484 1.8665 1.5892 1.8119 1.5003 2.3210 1.8195 1.5221 1.9528 2.2718 1.4213 2.8335 2.8203 1.4458 3.9648 2.7619 2.0342 2.9686 1.9214 1.7892 1.7071 2.1116 1.9192 1.1145 1.3474 1.1332 1.3126 1.2069 1.2528 1.3019 1.3604 1.3761 1.3687 1.4048 2.9786 5.1053 1.2165 2.5743 1.0878 1.0430 1.0927 1.0616 1.2010 2.2667 6.1138 6.1816 1.0633 1.0688 1.0733 1.0479 1.0625 1.0985 1.1002 1.0992 1.1003 1.0986 1.0843 1.0881 1.0913 1.0947 1.1008
irintensity: 0.0515 0.5436 0.2217 9.2662 0.5091 0.3045 0.3619 2.1661 1.5456 0.5143 7.0634 0.0906 15.6754 4.8935 10.7346 0.2347 1.3741 11.2034 37.6096 9.1751 80.7733 5.6054 14.5978 10.4657 7.2878 19.3638 18.3384 1.0693 14.4718 7.0640 1.6194 23.0221 20.4788 23.1168 9.0593 8.7013 3.9776 13.6098 12.2368 47.8734 13.2158 10.8553 8.7780 22.2545 1.3623 0.9585 1.4844 0.5177 3.7130 10.4661 32.0731 155.4386 10.3638 18.7679 0.5361 5.6160 12.7294 13.8700 22.0397 74.6568 117.5213 11.4057 190.0622 67.4996 52.0308 2.3142 43.5020 30.1012 53.3226 12.4933 57.2863 30.5289 29.6736 9.2700 7.8294 34.3397 41.2566 8.7648
temp: 298.150 k
press: 1.00000 atm
elementType: 8 7 6 6 6 6 6 6 6 6 6 6 6 1 1 1 1 1 1 1 1 1 1 1 1 1 1 1
symmnumber: 1
zpe: 623386.1 jmol-1
zpe.correction: 0.237435 hartree
zpe.thermalcorrener: 0.249575 hartree
zpe.thermalcorrenthalpy: 0.250520 hartree
zpe.thermalcorrgfe: 0.198772 hartree
zpe.sumelectzpe: -557.143247 hartree
zpe.sumelectthermal: -557.131106 hartree
zpe.sumelectthermalent: -557.130162 hartree
zpe.sumelectthermalfe: -557.181910 hartree
dipole: -0.7350 -1.0449 1.1233
dipole: 1.7011
quadrupole: -80.0892 -67.9279 -83.2078
quadrupole: 1.1564 -3.8248 -2.9598
quadrupole: -3.0143 9.1471 -6.1328 1.1564 -3.8248 -2.9598
hfenergy: -557.3806818 hartree
pointgroup: C01 [X(C11H15N1O1)]
dipole: -0.2917423 0.3936929 -0.4558817 debye
polarizability: 171.9576825|-5.7554989|132.4055389|2.3161501|-9.6155014|76.0711774 unknown
InChI: InChI=1S/C11H15NO/c1-2-11-12(8-9-13-11)10-6-4-3-5-7-10/h3-7,11H,2,8-9H2,1H3
charge 0 multiplicity 1
28 atoms
O  -2.671238 0.603894 0.74566
N  -0.497067 0.548486 -0.101429
C  -1.604693 -0.334583 0.345266
C  -0.948866 1.950306 -0.205118
C  -2.481654 1.804537 -0.095662
C  -2.093726 -1.30474 -0.752018
C  0.854689 0.195021 -0.018051
C  -3.176621 -2.270278 -0.229753
C  1.875304 1.167277 -0.255335
C  1.259521 -1.14141 0.292078
C  3.237236 0.812502 -0.1812
C  2.626048 -1.477056 0.366112
C  3.630648 -0.509625 0.129972
H  -1.331481 -0.889893 1.265386
H  -0.6498 2.410796 -1.166244
H  -0.535453 2.5653 0.622036
H  -2.970024 2.643819 0.421722
H  -2.943113 1.658801 -1.09314
H  -1.223196 -1.868252 -1.139527
H  -2.481924 -0.706418 -1.598656
H  -2.781822 -2.918548 0.575667
H  -4.032698 -1.705833 0.179689
H  -3.547248 -2.926166 -1.037619
H  1.603932 2.199241 -0.499172
H  0.511322 -1.919704 0.473331
H  3.997713 1.579926 -0.368179
H  2.90676 -2.508812 0.608717
H  4.690151 -0.779384 0.185465
