program: Gaussian 09
title: 000018260
version: EM64L-G09RevD.01
frameworkgroup: C1[X(C19H23NO3)]
method: RPBEPBE
basis: SDD
operation: Freq
keyword: #p
keyword: freq=noraman
keyword: PBEPBE/SDD
title: #p freq=noraman PBEPBE/SDD
converged: YES YES NO NO
title: Mulliken charges:
elementType: O O O N C C C C C C C C C C C C C C C C C C C H H H H H H H H H H H H H H H H H H H H H H H
charge: -0.300727 -0.246224 -0.256448 -0.304166 -0.001850 0.381363 0.362073 0.202155 -0.371483 -0.350260 -0.407325 -0.397318 -0.238732 -0.262379 -0.236129 -0.240510 -0.224475 -0.237925 -0.248405 -0.242424 -0.685041 -0.376579 -0.622027 0.243079 0.261051 0.279477 0.261407 0.215172 0.236389 0.247389 0.214998 0.222693 0.227113 0.222746 0.225900 0.224592 0.228346 0.225209 0.206392 0.225051 0.225097 0.208434 0.256018 0.194859 0.229759 0.223663
chargesum: 0.00000
title: Mulliken charges with hydrogens summed into heavy atoms:
elementType: O O O N C C C C C C C C C C C C C C C C C C C
charge: -0.300727 -0.246224 -0.256448 -0.048147 -0.001850 0.381363 0.362073 0.202155 -0.128404 -0.089209 -0.127848 -0.135911 0.212829 0.200009 -0.013436 -0.013397 -0.001728 -0.012025 -0.023813 -0.014078 -0.026459 0.055022 0.026254
polarizability: 2.38721041e+02 1.56762581e+01 2.11922143e+02 1.62880663e+01 1.26908178e+01 2.03741030e+02
1716.lowfreq: -6.6743 -4.1275 -0.0005 0.0002 0.0005 3.7080 14.5664 28.5265 32.7767
frequency: 14.4377 28.4395 32.7334 37.1410 42.6891 48.4207 59.4410 65.5252 91.4637 93.2690 105.1079 130.9260 139.5328 180.3904 195.4126 223.8646 225.7451 240.0752 243.7626 267.8352 269.4454 292.6267 301.2220 331.5661 341.9096 400.3654 402.7643 405.4896 448.9055 472.4732 509.0168 557.9490 615.6558 616.1046 642.3784 658.5727 665.7037 701.8008 703.9194 712.4122 752.3513 764.1210 785.6303 809.0401 813.3005 843.9133 854.3050 857.8431 874.4605 920.8428 928.3512 934.5766 958.3804 966.8577 971.7389 979.6512 982.8216 990.7616 991.6240 997.6564 998.3809 1029.2132 1032.4552 1032.9735 1039.9980 1084.4969 1085.0466 1090.3084 1110.2739 1120.4050 1140.6831 1148.5448 1155.3690 1168.6552 1170.6055 1173.4529 1187.7195 1197.3918 1202.7966 1218.6129 1229.9636 1258.6234 1266.2458 1315.8401 1316.3008 1327.2333 1363.1359 1378.5946 1382.8605 1386.0107 1392.2109 1434.0941 1434.8921 1436.6933 1452.9967 1460.0629 1467.7636 1471.4027 1479.9372 1481.6598 1482.2179 1488.4425 1497.3706 1499.6208 1589.6056 1592.8591 1596.5455 1610.1362 1613.8068 2880.9819 2896.2373 2982.0223 2991.1755 3005.3852 3018.5153 3037.0299 3040.6278 3078.9175 3088.0259 3088.7703 3098.2903 3119.5150 3123.6801 3128.0001 3133.1307 3141.0173 3145.8347 3158.0146 3159.7366 3175.2837 3182.2654 3451.2305
redmass: 3.9994 3.5548 4.0609 3.2805 2.6828 3.0031 2.4214 4.4173 2.7870 3.0136 3.2619 3.5413 3.7640 3.2529 3.0507 1.7642 3.7258 1.8627 2.6357 3.3764 3.2037 4.7826 3.6669 7.7583 4.9224 2.8391 2.8673 3.3226 5.0680 3.9684 3.9202 4.2995 6.3824 6.4207 6.0105 2.7260 1.7989 2.0156 1.8461 4.1353 2.5920 2.1474 2.8953 1.1507 1.1033 3.5799 1.2632 1.2528 6.3187 1.5782 1.5445 7.3984 3.2133 2.5119 4.8788 1.4277 1.4048 5.9402 5.2911 1.3241 1.3467 2.1947 2.5499 2.5437 1.4923 1.5961 2.0398 1.6558 2.2189 1.5832 1.4874 2.2813 2.3263 2.8647 1.0536 1.0537 1.1659 1.4251 2.2104 1.5279 4.3014 1.1464 1.1174 1.3214 1.3095 1.3240 1.2874 8.0169 8.7752 1.4815 1.2677 2.2290 2.2236 1.1530 1.2017 1.0410 1.0755 1.0778 2.1651 1.0702 2.1583 1.0646 1.0633 1.0841 6.0267 6.7487 9.6685 5.9578 6.2301 1.0562 1.0699 1.0554 1.0366 1.0612 1.0762 1.0878 1.1066 1.0997 1.1057 1.0987 1.1016 1.0846 1.0847 1.0885 1.0885 1.0941 1.0941 1.0995 1.0984 1.0963 1.0946 1.0745
irintensity: 0.8493 0.1207 0.1012 0.2664 0.3346 0.6138 1.2977 0.8131 4.1842 0.4078 2.9295 1.2558 0.5495 3.3549 0.6006 0.2739 4.9579 0.0554 1.7746 11.3348 10.0008 0.9370 5.9261 1.1262 0.8101 0.3467 0.1708 16.0571 7.1435 10.2795 3.8582 1.9887 0.0941 0.1365 16.9541 78.0776 60.8982 48.5098 44.6037 22.0607 51.1908 39.9896 11.7715 0.9974 0.8011 4.0314 0.4684 0.1698 9.1395 11.1106 19.2936 48.5328 15.4015 11.9916 101.8212 0.6465 1.7133 0.6104 4.7464 0.0766 3.0804 27.6917 34.7413 48.4519 46.6575 2.7764 1.7578 16.4990 7.1287 0.9105 31.7162 225.2777 80.0112 56.8539 1.8259 0.1192 24.7466 16.3726 35.9938 1.4048 7.1829 1.0373 2.2749 2.3614 0.1124 3.4722 2.1670 0.0937 0.3193 1.8583 24.7437 18.8254 9.5018 2.6257 19.6151 10.5347 8.9940 3.4564 24.5734 3.9523 15.6989 14.7276 9.8982 5.1918 1.3648 28.6240 154.3267 0.3542 2.3312 119.8414 98.8329 28.8699 30.3844 18.6915 48.9821 14.3166 15.9536 38.0063 26.6746 30.7123 40.5658 1.4727 0.2545 5.6286 6.9273 34.4018 25.9916 32.1265 28.2814 9.0435 5.9256 0.6706
temp: 298.150 k
press: 1.00000 atm
elementType: 8 8 8 7 6 6 6 6 6 6 6 6 6 6 6 6 6 6 6 6 6 6 6 1 1 1 1 1 1 1 1 1 1 1 1 1 1 1 1 1 1 1 1 1 1 1
symmnumber: 1
zpe: 991183.4 jmol-1
zpe.correction: 0.377522 hartree
zpe.thermalcorrener: 0.401147 hartree
zpe.thermalcorrenthalpy: 0.402092 hartree
zpe.thermalcorrgfe: 0.320870 hartree
zpe.sumelectzpe: -1016.503901 hartree
zpe.sumelectthermal: -1016.480275 hartree
zpe.sumelectthermalent: -1016.479331 hartree
zpe.sumelectthermalfe: -1016.560553 hartree
dipole: 0.8799 0.7490 -1.1286
dipole: 1.6153
quadrupole: -117.9655 -137.8144 -125.9792
quadrupole: 3.3077 -3.7186 0.8267
quadrupole: 9.2875 -10.5614 1.2738 3.3077 -3.7186 0.8267
hfenergy: -1016.8814226 hartree
pointgroup: C01 [X(C19H23N1O3)]
dipole: 0.2905768 -0.3624369 0.4336601 debye
polarizability: 237.3254299|-17.5219276|212.7559445|-14.5491321|13.9257174|204.3028393 unknown
InChI: InChI=1S/C19H23NO3/c1-3-23-19(16-10-6-4-7-11-16,17-12-8-5-9-13-17)18(21)22-15-14-20-2/h4-13,20H,3,14-15H2,1-2H3
charge 0 multiplicity 1
46 atoms
O  -0.589656 0.902956 -1.786415
O  1.865215 0.424785 0.209003
O  0.664298 2.366613 0.606852
N  5.482023 0.740188 1.055136
C  -0.503764 0.391987 -0.382555
C  -0.206356 -1.114191 -0.511136
C  -1.831619 0.61962 0.363798
C  0.697441 1.167761 0.230575
C  -0.358533 -1.956388 0.617598
C  -2.999841 0.07197 -0.231308
C  0.243322 -1.668091 -1.732262
C  -1.949868 1.307247 1.594917
C  -1.064271 2.298359 -1.969024
C  3.109583 1.143116 0.616159
C  -0.062089 -3.33329 0.528416
C  -4.257731 0.210796 0.387731
C  0.531289 -3.048625 -1.823531
C  -3.212189 1.437485 2.222063
C  0.384591 -3.886368 -0.69449
C  -4.36899 0.893636 1.623248
C  -1.054506 2.5510 -3.476675
C  4.228796 0.098991 0.610504
C  6.701241 -0.060243 0.835707
H  -0.719928 -1.538903 1.564582
H  -2.908042 -0.463832 -1.182851
H  0.355674 -1.014045 -2.600169
H  -1.070294 1.760555 2.05925
H  -2.083513 2.399762 -1.548391
H  -0.394246 2.997488 -1.433658
H  3.31042 1.957865 -0.100174
H  2.951013 1.588314 1.617008
H  -0.185171 -3.97441 1.40878
H  -5.148515 -0.216708 -0.086142
H  0.873309 -3.468992 -2.776396
H  -3.288244 1.971832 3.1758
H  0.610106 -4.956562 -0.766512
H  -5.345022 0.998728 2.110329
H  4.373328 -0.269977 -0.421624
H  3.919406 -0.77912 1.227126
H  -1.712743 1.835355 -3.999373
H  -0.034241 2.4481 -3.885399
H  -1.413489 3.575016 -3.687881
H  5.414372 1.084101 2.02193
H  6.688983 -1.065134 1.323761
H  6.84743 -0.218545 -0.24867
H  7.579221 0.493896 1.211866
