program: Gaussian 09
title: 000254586
version: EM64L-G09RevD.01
frameworkgroup: C1[X(C9H11ClN2O2)]
method: RPBEPBE
basis: SDD
operation: Freq
keyword: #p
keyword: freq=noraman
keyword: PBEPBE/SDD
title: #p freq=noraman PBEPBE/SDD
converged: YES YES NO NO
title: Mulliken charges:
elementType: Cl O O N N C C C C C C C C C H H H H H H H H H H H
charge: -0.067648 -0.193405 -0.274649 -0.487318 -0.361082 0.471651 -0.439264 -0.342345 -0.196624 -0.210955 -0.227633 -0.256524 0.306423 -0.562878 0.215027 0.304620 0.292607 0.251811 0.243898 0.226709 0.226886 0.229703 0.266707 0.282118 0.302166
chargesum: 0.00000
title: Mulliken charges with hydrogens summed into heavy atoms:
elementType: Cl O O N N C C C C C C C C C
charge: -0.067648 -0.193405 -0.274649 -0.194711 -0.058916 0.471651 -0.224238 -0.037725 0.030085 0.015931 0.268076 -0.026821 0.306423 -0.014053
polarizability: 2.04075651e+02 5.16884901e-01 1.24921166e+02 -1.54737387e+01 9.56743041e+00 6.81263883e+01
1716.lowfreq: -5.2937 -0.0027 -0.0024 -0.0006 4.4091 10.8093 24.2172 29.5401 46.8313
frequency: 23.2230 28.6002 46.3507 69.5029 87.1524 97.4653 168.1951 221.2606 228.6431 290.1757 302.8069 341.8002 369.5148 407.3821 426.7578 506.3289 522.9185 583.3007 597.3365 613.7694 614.7975 691.7354 695.6859 750.4359 765.1492 773.9963 826.4279 839.6155 912.3832 913.6908 958.3603 970.5053 982.9842 989.8680 998.1104 1023.3261 1040.0042 1077.0174 1090.8709 1172.5039 1173.4841 1179.5192 1189.2929 1220.6796 1258.9490 1296.5390 1320.0920 1348.1699 1382.3387 1407.5283 1427.6314 1433.0551 1438.8786 1486.1787 1516.4259 1602.0414 1615.8283 1645.1645 3002.0447 3059.6998 3100.8300 3106.0662 3132.5823 3143.1908 3144.5283 3165.9432 3195.3078 3491.8346 3521.8137
redmass: 7.4539 6.1206 3.9823 5.7856 5.4762 6.1016 6.9524 3.1072 3.1184 4.5077 5.7665 6.7676 1.5456 2.9211 2.5291 2.6235 3.9573 1.3854 4.7729 5.4105 5.4045 10.5782 2.0008 5.3467 1.6844 3.4277 4.2883 1.2695 2.1930 1.4402 3.4923 1.3534 4.8326 2.7117 1.3065 2.6331 2.6280 2.4564 1.5941 1.0506 1.4303 2.1967 1.1123 1.1773 2.2332 1.1816 1.4284 1.2635 4.2027 1.5154 1.2870 1.7879 1.1019 2.3396 2.0871 5.4005 5.8976 5.2875 1.0629 1.0576 1.1009 1.0888 1.0866 1.1093 1.0932 1.0998 1.0950 1.0785 1.0758
irintensity: 0.6022 1.8936 2.3144 5.4501 9.6361 1.1583 8.2314 2.6970 2.1140 7.0577 19.4490 10.6641 22.9040 0.0309 71.5320 74.3359 3.5342 109.2003 10.1089 18.6502 28.3764 26.1588 42.7312 17.3034 100.5916 4.4499 0.3359 0.1029 30.7623 18.5984 20.4144 0.1330 2.2526 12.9987 2.7764 1.9698 11.0824 26.8750 13.9213 0.6393 20.1833 202.9219 4.2068 3.2929 52.4762 29.0679 58.4529 1.3884 35.1124 142.6778 39.9413 131.6083 11.7157 69.4598 411.9171 46.0789 74.3619 123.1244 18.3618 14.3401 5.2965 17.5969 0.4028 9.5947 30.3843 23.6512 7.1123 16.4157 12.6204
temp: 298.150 k
press: 1.00000 atm
elementType: 17 8 8 7 7 6 6 6 6 6 6 6 6 6 1 1 1 1 1 1 1 1 1 1 1
symmnumber: 1
zpe: 502584.6 jmol-1
zpe.correction: 0.191424 hartree
zpe.thermalcorrener: 0.205277 hartree
zpe.thermalcorrenthalpy: 0.206222 hartree
zpe.thermalcorrgfe: 0.147820 hartree
zpe.sumelectzpe: -1068.480337 hartree
zpe.sumelectthermal: -1068.466484 hartree
zpe.sumelectthermalent: -1068.465540 hartree
zpe.sumelectthermalfe: -1068.523942 hartree
dipole: -1.4064 -2.2847 1.1070
dipole: 2.9023
quadrupole: -91.7708 -82.3582 -92.0144
quadrupole: 8.7591 2.6468 6.2930
quadrupole: -3.0563 6.3563 -3.2999 8.7591 2.6468 6.2930
hfenergy: -1068.6717617 hartree
pointgroup: C01 [X(C9H11Cl1N2O2)]
dipole: -0.6302125 0.9225134 -0.2357888 debye
dipolederiv: -0.3878192 -0.1650175 -0.0780606 -0.2173287 -0.3676691 -0.0712909 -0.1535978 -0.1396811 -0.2617767 -0.4669647 -0.0820451 0.0955995 0.1983824 -0.233303 -0.0414732 -0.0333268 -0.0360519 -0.2801638 -0.8051881 0.0243524 -0.0546927 0.1735936 -0.8330506 -0.1169887 0.0791508 -0.2159104 -0.3993924 -2.1169555 0.1032107 -0.2924589 0.4528376 -0.3176886 0.096417 -0.2887021 0.0270127 -0.383873 -0.9703019 -0.272738 -0.1326216 -0.8677377 -0.3272294 -0.0528931 0.2154908 0.1131484 -0.2603697 1.3344253 0.0892486 0.3481657 0.3595935 0.0568737 0.0521364 0.5459523 -0.004664 0.2331844 -0.3754164 -0.0494988 -0.0511168 0.1133545 0.0004048 0.1412331 0.0222856 0.0974471 -0.1611369 -0.2711795 -0.0287645 -0.0249702 -0.2551566 -0.0990871 -0.0292905 -0.1555094 0.0238838 -0.1926665 0.1129284 -0.0226922 0.0604482 -0.1055657 0.0714394 0.0746714 0.0234476 0.0968159 -0.0825686 0.0954767 -0.0316739 0.0505503 0.038493 0.1130158 0.1309452 0.0870465 0.1157105 -0.0619868 0.5001189 -0.0309555 -0.1422348 -0.1669662 0.1403054 -0.001868 -0.5225542 -0.0818205 0.2748847 -0.0833642 0.0310128 0.0564335 0.0336457 -0.1640553 0.0230419 0.0467165 0.0224541 -0.1619588 2.6109275 0.0261363 0.3010994 -0.2593418 1.0942366 0.2031295 0.1353065 0.3580761 0.4021977 0.3815648 0.2044807 0.2015413 0.3244273 0.3497203 0.2377254 0.3455327 0.2353699 0.2344376 0.064884 -0.0679974 -0.0663528 -0.0474352 -0.0442422 -0.1181031 -0.0534333 -0.1245206 0.0913034 0.1524416 0.0666069 0.0154513 0.0605003 0.0900173 -0.0305412 0.0157162 -0.02673 0.168162 0.149794 0.0220698 -0.0341357 -0.0068372 0.1280901 -0.0942011 -0.0627816 -0.0854525 0.2509937 0.1096655 -0.0831201 -0.0504186 -0.0601579 0.021437 -0.070403 0.0784947 -0.0194718 -0.0119875 -0.0454877 0.0821992 -0.0174003 0.0723207 0.066624 0.0345838 0.0137064 0.0797461 0.0390556 -0.0303568 0.1082752 0.0013106 0.1256119 -0.0016951 -0.043839 0.0058221 -0.0480855 0.1356687 0.0715984 -0.0226495 -0.0339033 -0.0468732 -0.0507631 -0.1116872 -0.0470861 -0.1065824 0.0874292 -0.100809 -0.0242487 -0.0892434 -0.0249247 0.0991126 -0.0426427 -0.0915939 -0.0432185 0.1230769 -0.0467639 -0.0291737 0.0529399 -0.0487314 0.0473966 -0.0909706 0.0601989 -0.0730883 -0.0453422 0.013988 0.0528407 -0.1074596 0.0064761 -0.016202 -0.0019371 -0.1507834 -0.0397061 0.047329 0.1027937 0.1001415 -0.0084707 0.1478196 0.176312 -0.0757542 -0.1154992 -0.1246811 0.2155 unknown
polarizability: 199.485073|1.4682429|114.9338399|26.6479994|25.3695445|82.7042919 unknown
InChI: InChI=1S/C9H11ClN2O2/c10-6-7-14-12-9(13)11-8-4-2-1-3-5-8/h1-5,11-12H,6-7H2
charge 0 multiplicity 1
25 atoms
Cl 5.471367 1.834126 0.728309
O  2.975608 -0.156539 1.469677
O  0.803132 -1.207214 0.069777
N  -0.466495 0.695412 0.697814
N  1.84715 0.649618 1.049094
C  -1.753219 0.38787 0.165632
C  -2.777116 1.357488 0.346221
C  -2.043182 -0.823769 -0.516555
C  -4.07522 1.122068 -0.149146
C  -3.348338 -1.040686 -1.009298
C  3.862231 -0.458137 0.315905
C  -4.370362 -0.080089 -0.833379
C  0.708317 -0.05932 0.58655
C  4.394047 0.769775 -0.402945
H  -2.557216 2.295672 0.873425
H  -1.257116 -1.569857 -0.644446
H  -0.409647 1.589096 1.191901
H  3.301644 -1.090824 -0.399995
H  4.667791 -1.04645 0.785013
H  -4.85389 1.87851 -0.001446
H  -3.565533 -1.977716 -1.534413
H  -5.378404 -0.264005 -1.219393
H  5.038834 0.480391 -1.247069
H  3.578822 1.426877 -0.73906
H  1.768495 1.461704 1.670726
