program: Gaussian 09
title: 000254553
version: EM64L-G09RevD.01
frameworkgroup: C1[X(C12H11NO4S)]
method: RPBEPBE
basis: SDD
operation: Freq
keyword: #p
keyword: freq=noraman
keyword: PBEPBE/SDD
title: #p freq=noraman PBEPBE/SDD
converged: YES YES NO NO
title: Mulliken charges:
elementType: S O O O O N C C C C C C C C C C C C H H H H H H H H H H H
charge: 0.955352 -0.509438 -0.532356 -0.467008 -0.427821 -0.531172 -0.202309 0.339243 0.344479 -0.402816 0.320197 -0.300744 -0.323652 -0.310971 -0.355829 -0.210335 -0.202593 -0.239731 0.315431 0.296462 0.238195 0.261783 0.278157 0.231210 0.232261 0.228018 0.231469 0.377856 0.366664
chargesum: 0.00000
title: Mulliken charges with hydrogens summed into heavy atoms:
elementType: S O O O O N C C C C C C C C C C C C
charge: 0.955352 -0.509438 -0.532356 -0.089152 -0.061157 -0.215741 -0.202309 0.339243 0.344479 -0.106354 0.320197 -0.062549 -0.061869 -0.032814 -0.124618 0.021926 0.025425 -0.008262
polarizability: 1.98083579e+02 -1.33750869e+01 1.79541843e+02 -9.23335119e+00 -2.60870021e-01 1.72655064e+02
1716.lowfreq: -8.8843 -7.0603 -0.0018 -0.0015 -0.0010 5.8332 20.1813 34.0390 52.3179
frequency: 19.6906 33.9188 52.2585 91.8012 95.3315 121.1228 148.0349 165.4042 187.9433 205.1369 221.3819 235.5438 263.1972 305.6115 343.3731 350.0596 359.4143 383.0698 399.8040 415.2821 439.3472 450.6067 468.5079 484.9712 508.8414 558.5725 581.3547 611.9620 660.7780 689.8999 705.2963 746.8570 768.2817 802.0192 808.9739 818.5635 835.1299 857.1381 876.1068 881.7831 914.6709 937.0616 957.3162 972.3407 985.2614 992.8659 1003.4374 1022.1964 1079.4074 1097.9236 1134.3055 1149.4417 1171.9502 1181.3921 1220.5712 1228.3611 1248.3678 1259.4907 1301.4394 1338.0396 1388.7818 1391.9413 1423.6339 1448.2896 1472.7854 1495.1703 1580.8979 1582.2670 1600.0098 1636.7461 3123.1767 3127.2529 3133.3329 3134.5453 3146.5730 3163.3880 3179.7561 3181.3023 3356.9669 3588.5851 3603.8719
redmass: 6.5449 4.6784 4.8639 6.3190 5.4833 5.8546 5.8966 6.6722 9.1809 7.9371 2.9998 1.9354 4.8776 5.7357 5.8702 5.3627 1.1725 7.1673 3.1644 3.1432 4.6472 6.5718 5.7738 4.2176 4.0364 4.9060 4.1783 6.2847 7.6467 1.8279 3.7356 6.8741 1.7810 5.2481 1.4579 6.1941 1.3030 6.7829 1.4553 1.6068 1.4731 1.3617 7.9556 1.4076 6.1537 1.3291 2.9582 2.1418 1.5593 1.5831 1.3896 1.1854 1.0566 1.1510 1.6572 3.3435 2.1045 1.3724 1.9614 1.2712 4.2831 5.8562 4.3161 2.1864 2.2071 2.9967 6.9158 5.8512 5.8777 7.1617 1.0862 1.0919 1.0905 1.0881 1.0938 1.0983 1.0952 1.0974 1.0748 1.0663 1.0665
irintensity: 0.4555 0.4037 0.3087 0.4575 2.8447 10.6466 0.7244 4.0419 8.5274 3.4617 36.1803 45.1991 30.1995 5.3937 26.9879 18.3007 112.7251 11.6481 6.3283 3.3511 61.5031 17.0473 139.6220 2.4552 3.4101 4.6969 1.5828 1.9453 12.9020 41.1011 5.2268 35.2833 71.6715 33.7050 33.6501 51.1154 6.1524 2.9135 44.3026 114.1121 4.3060 0.4522 48.4918 0.5633 0.0453 0.6469 6.3055 4.8316 16.3290 190.5721 54.6063 163.7646 0.0033 1.5353 7.3675 1.9129 5.5479 10.7026 33.5932 3.3184 124.4629 2.4737 33.9558 11.6200 21.0635 106.4244 9.8932 1.5712 1.3275 10.7681 4.3860 15.5173 9.0709 1.2311 25.8077 27.0071 3.4308 4.6590 17.6028 58.9905 52.1558
temp: 298.150 k
press: 1.00000 atm
elementType: 16 8 8 8 8 7 6 6 6 6 6 6 6 6 6 6 6 6 1 1 1 1 1 1 1 1 1 1 1
symmnumber: 1
zpe: 543747.5 jmol-1
zpe.correction: 0.207102 hartree
zpe.thermalcorrener: 0.224400 hartree
zpe.thermalcorrenthalpy: 0.225345 hartree
zpe.thermalcorrgfe: 0.161025 hartree
zpe.sumelectzpe: -1216.096539 hartree
zpe.sumelectthermal: -1216.079241 hartree
zpe.sumelectthermalent: -1216.078297 hartree
zpe.sumelectthermalfe: -1216.142616 hartree
dipole: -1.5479 -5.6002 3.6893
dipole: 6.8825
quadrupole: -107.9367 -127.7193 -91.7373
quadrupole: -3.6315 -5.7375 5.9267
quadrupole: 1.1944 -18.5882 17.3938 -3.6315 -5.7375 5.9267
hfenergy: -1216.3036416 hartree
pointgroup: C01 [X(C12H11N1O4S1)]
dipole: 0.445632 2.0161977 1.7517083 debye
polarizability: 202.1922026|-11.5873949|175.8464081|5.2473064|2.8343266|172.2418749 unknown
InChI: InChI=1S/C12H11NO4S/c14-10-6-7-11(15)12(8-10)18(16,17)13-9-4-2-1-3-5-9/h1-8,13-15H
charge 0 multiplicity 1
29 atoms
S  0.308722 -1.753635 -0.907849
O  1.102255 -3.150753 -0.716618
O  -0.196988 -1.276182 -2.3775
O  1.271082 -1.274705 1.947337
O  2.992034 2.774159 -1.582837
N  -1.25697 -1.870783 0.256597
C  1.357139 -0.302268 -0.257292
C  1.774486 -0.280799 1.086313
C  -2.056969 -0.693478 0.299422
C  1.71908 0.687916 -1.182356
C  2.562316 1.736126 -0.745005
C  2.618999 0.774621 1.507718
C  3.019755 1.768555 0.594255
C  -2.846735 -0.359986 -0.837159
C  -2.120032 0.119222 1.467999
C  -3.694083 0.764669 -0.791354
C  -2.998731 1.221213 1.51363
C  -3.782061 1.553185 0.382575
H  -0.810394 -2.103611 1.165998
H  1.338532 0.616314 -2.209266
H  2.956772 0.826252 2.549733
H  3.674934 2.586708 0.905485
H  -2.788717 -0.992629 -1.727244
H  -1.490851 -0.12825 2.332109
H  -4.30066 1.018942 -1.667375
H  -3.062745 1.829074 2.422958
H  -4.455524 2.416483 0.415689
H  1.832197 -1.382307 2.753242
H  2.630157 2.672943 -2.497804
