program: Gaussian 09
title: 000254547
version: EM64L-G09RevD.01
frameworkgroup: C1[X(C8H13ClO5)]
method: RPBEPBE
basis: SDD
operation: Freq
keyword: #p
keyword: freq=noraman
keyword: PBEPBE/SDD
title: #p freq=noraman PBEPBE/SDD
converged: YES YES NO NO
title: Mulliken charges:
elementType: Cl O O O O O C C C C C C C C H H H H H H H H H H H H H
charge: -0.050919 -0.251822 -0.264638 -0.458860 -0.217478 -0.259414 -0.083605 -0.112637 -0.699150 0.277113 0.232006 -0.661551 -0.223044 -0.561158 0.266156 0.238327 0.243614 0.238394 0.242337 0.244287 0.225209 0.223439 0.237581 0.268256 0.264062 0.279827 0.363667
chargesum: 0.00000
title: Mulliken charges with hydrogens summed into heavy atoms:
elementType: Cl O O O O O C C C C C C C C
charge: -0.050919 -0.251822 -0.264638 -0.095193 -0.217478 -0.259414 0.182551 0.125690 0.025195 0.277113 0.232006 0.031385 0.282793 -0.017269
polarizability: 1.35245658e+02 8.36879543e-01 1.12005085e+02 -6.90810211e+00 6.45406630e+00 8.65320405e+01
1716.lowfreq: -10.2873 -0.0015 -0.0012 -0.0006 2.4627 9.9794 13.2987 23.9789 35.8508
frequency: 13.2814 23.3175 35.6462 41.4673 57.6255 82.9171 125.4213 136.0711 167.9376 186.3096 215.7164 225.2116 252.7235 269.8040 281.2519 313.5917 346.9376 355.9842 358.1337 417.8896 438.0379 519.6206 604.8519 610.4882 649.0370 695.5227 719.7764 795.4192 816.0937 833.3553 882.5742 919.6495 938.0851 991.4679 1021.9694 1028.2494 1066.0508 1078.7399 1086.2847 1110.3319 1110.8424 1140.7700 1179.0964 1181.7952 1219.7201 1238.1456 1283.6876 1298.0751 1303.9086 1319.2753 1357.7648 1371.3973 1387.0782 1394.3577 1434.8312 1460.7652 1462.6745 1465.4280 1476.1543 1477.5995 1615.4505 1669.8755 2967.0411 3003.1512 3007.3313 3007.9408 3050.5075 3062.2630 3088.4990 3108.3910 3114.3337 3114.6047 3115.7232 3146.6271 3480.0450
redmass: 7.4212 4.8454 9.0057 5.2602 6.5700 9.2037 4.1008 3.6487 3.8133 2.6349 1.0512 1.3621 2.8533 2.6032 2.0415 4.8686 2.2268 5.7235 4.8860 2.6026 2.8786 4.2199 5.3075 4.8192 5.7714 4.3048 3.9742 3.0297 3.8467 3.8862 2.6602 2.3908 2.3480 1.7997 1.9831 2.1231 2.1026 2.5186 2.2590 2.2619 3.3270 2.2139 2.7504 1.2930 1.1574 1.2493 1.4396 1.1995 1.2476 1.3687 1.4100 1.5460 1.2154 1.2120 1.1029 1.0796 1.0625 1.0461 1.0534 1.0515 10.9285 10.6662 1.0825 1.0345 1.0352 1.0597 1.0853 1.0590 1.1026 1.1011 1.1009 1.1012 1.1006 1.1099 1.0652
irintensity: 1.5472 3.9564 1.0136 4.8812 1.5552 3.1036 0.6773 0.3020 3.6673 3.1413 0.5293 1.4519 3.0515 16.8434 56.9187 28.7158 54.3612 11.3540 8.4706 16.8260 12.8805 1.5812 15.8150 20.4305 9.5318 0.8271 14.0702 1.9847 1.6620 2.9040 8.9852 9.4770 31.8016 15.4239 39.2956 12.3452 218.0702 271.9160 62.5902 156.5411 114.4313 83.0623 134.5153 2.9148 5.9390 57.5590 6.0648 17.3684 0.3272 19.4490 2.3902 27.3877 13.8727 21.8524 10.2811 16.5099 19.5859 13.3810 13.2327 15.5539 158.9338 159.8080 27.5167 15.7398 12.8991 17.9521 3.4104 19.9276 4.7704 23.7845 25.0013 11.8598 10.6217 8.1275 26.3523
temp: 298.150 k
press: 1.00000 atm
elementType: 17 8 8 8 8 8 6 6 6 6 6 6 6 6 1 1 1 1 1 1 1 1 1 1 1 1 1
symmnumber: 1
zpe: 543272.1 jmol-1
zpe.correction: 0.206921 hartree
zpe.thermalcorrener: 0.223595 hartree
zpe.thermalcorrenthalpy: 0.224539 hartree
zpe.thermalcorrgfe: 0.158939 hartree
zpe.sumelectzpe: -1147.712439 hartree
zpe.sumelectthermal: -1147.695766 hartree
zpe.sumelectthermalent: -1147.694822 hartree
zpe.sumelectthermalfe: -1147.760422 hartree
dipole: 3.4218 0.5629 -1.9667
dipole: 3.9866
quadrupole: -96.8840 -84.6550 -91.7183
quadrupole: -17.8813 -3.2917 0.1855
quadrupole: -5.7982 6.4308 -0.6326 -17.8813 -3.2917 0.1855
hfenergy: -1147.9193606 hartree
pointgroup: C01 [X(C8H13Cl1O5)]
dipole: -1.3958539 0.2094704 0.6839329 debye
polarizability: 135.988466|-1.1366798|113.2708288|-3.0223197|-2.8512168|84.5234879 unknown
InChI: InChI=1S/C8H13ClO5/c1-5(10)7(11)14-6(2)8(12)13-4-3-9/h5-6,10H,3-4H2,1-2H3
charge 0 multiplicity 1
27 atoms
Cl -4.56183 1.121479 -0.753372
O  1.413865 0.849993 0.177342
O  -1.995522 -0.455472 0.35832
O  4.285109 -1.437375 -0.058658
O  -0.499477 -0.472714 -1.443443
O  1.705771 -1.365483 0.844891
C  0.003393 0.793545 0.643799
C  3.553362 -0.195229 -0.283564
C  -0.523478 2.233454 0.614477
C  -0.805065 -0.120092 -0.28978
C  2.148634 -0.319007 0.310097
C  4.352927 0.982164 0.305477
C  -3.012204 -1.19919 -0.42677
C  -4.378229 -0.631871 -0.086142
H  -0.025418 0.363809 1.660508
H  3.419624 -0.038909 -1.375063
H  -1.579103 2.250823 0.932949
H  0.070334 2.861646 1.298649
H  -0.45159 2.651368 -0.403438
H  5.362445 0.975708 -0.137589
H  3.861976 1.942827 0.075954
H  4.455637 0.874161 1.398736
H  -2.958142 -2.259143 -0.112667
H  -2.774615 -1.1256 -1.501854
H  -5.177841 -1.222717 -0.558663
H  -4.536809 -0.557025 0.999191
H  3.647049 -2.112148 0.302212
