program: Gaussian 09
title: 000254741
version: EM64L-G09RevD.01
frameworkgroup: C1[X(C14H26O7)]
method: RPBEPBE
basis: SDD
operation: Freq
keyword: #pfreq=noraman
keyword: PBEPBE/SDD
title: #p freq=noraman PBEPBE/SDD
converged: YES YES NO NO
title: Mulliken charges:
elementType: O O O O O O O C C C C C C C C C C C C C C H H H H H H H H H H H H H H H H H H H H H H H H H H
charge: -0.291991 -0.267859 -0.272456 -0.254734 -0.449006 -0.223759 -0.250234 -0.395080 -0.251536 -0.345522 -0.227136 -0.323851 -0.084929 -0.266490 -0.698096 -0.293727 0.263478 -0.699156 -0.146081 0.236382 -0.655864 0.195882 0.261220 0.182907 0.186537 0.194395 0.185027 0.189425 0.199060 0.218598 0.201871 0.269633 0.224849 0.216567 0.214463 0.209093 0.230111 0.239812 0.269180 0.234752 0.239335 0.240537 0.243096 0.223255 0.229561 0.241157 0.357323
chargesum: 0.00000
title: Mulliken charges with hydrogens summed into heavy atoms:
elementType: O O O O O O O C C C C C C C C C C C C C C
charge: -0.291991 -0.267859 -0.272456 -0.254734 -0.091682 -0.223759 -0.250234 0.062022 0.117908 0.033900 0.161349 0.096617 0.184704 0.174925 -0.044428 0.215266 0.263478 0.015468 0.097015 0.236382 0.038109
polarizability: 2.04425908e+02 1.55875458e+01 1.83719224e+02 3.32439946e+00 -2.27673438e+00 1.46250979e+02
1716.lowfreq: -13.8553 -6.5941 -4.3785 -0.0011 -0.0009 0.0002 6.6466 17.8077 23.8859
frequency: -1.1894 17.6034 23.8402 37.7523 40.2388 44.2818 45.8076 51.7099 62.0615 74.9324 89.0992 90.6385 112.8194 121.7169 125.2634 154.0783 190.2739 202.5183 205.3665 218.0191 231.1763 235.3044 251.7693 260.8351 279.1350 285.8010 296.5417 327.5479 343.2956 361.0503 366.7900 390.7991 413.3381 434.6430 455.9654 520.5953 544.9495 608.9461 649.8051 692.1184 712.5660 748.0608 788.1008 790.3330 812.4029 818.0487 819.5030 835.6394 851.9339 903.0546 905.3145 927.1044 937.0857 952.3886 984.0280 1015.9943 1028.9484 1034.7674 1055.7178 1061.7861 1068.0080 1069.8011 1077.8489 1079.1583 1092.1403 1098.4071 1117.6832 1128.3844 1143.7306 1148.6751 1151.7979 1163.4842 1197.2891 1213.1377 1227.6215 1246.5274 1269.4508 1274.9684 1279.1353 1283.7076 1284.5909 1293.6421 1300.1344 1309.7957 1319.8491 1334.8747 1355.5835 1361.9363 1376.4089 1379.4060 1382.0730 1389.0195 1390.7104 1399.8375 1440.6893 1455.2875 1459.7473 1461.0986 1464.7576 1467.9421 1469.5308 1473.1344 1476.9992 1477.3182 1479.8618 1486.0891 1497.5621 1626.5561 1653.4761 2906.4472 2915.9547 2957.0810 2962.0831 2963.5784 2974.7812 2981.6075 2994.3125 2996.0040 2997.6298 3007.2650 3009.1105 3037.6774 3047.1993 3048.7445 3064.7292 3066.2403 3070.2273 3073.1682 3075.5386 3101.3638 3110.5307 3110.9595 3118.0518 3132.1986 3494.8912
redmass: 4.1187 4.5299 4.1372 3.9635 3.7437 4.4725 3.2192 4.1381 2.3184 4.1072 4.2507 4.5107 2.4840 3.7156 2.3291 3.4719 2.6986 1.3127 1.3112 2.1746 2.1959 1.2528 3.9611 3.2601 3.0081 2.3376 4.2270 4.9804 1.8752 2.9885 4.4410 4.1458 3.4064 2.6380 3.7824 2.2964 4.7271 5.6244 5.1345 4.5628 3.9418 1.0737 3.4361 1.5948 1.1409 2.8021 2.7907 2.7118 4.2047 1.7532 3.3434 3.2190 1.2339 2.4336 3.7623 2.0135 1.9659 3.3071 2.5820 3.8526 2.7531 3.4424 2.3299 2.5312 1.9540 3.1212 2.8751 2.7037 1.7885 1.8402 1.7771 2.6809 1.1517 1.3555 1.2400 1.5315 1.1982 1.1598 1.1841 1.1135 1.4316 1.1085 1.3003 1.2769 1.3344 1.2824 1.4384 1.2843 1.2502 1.2773 1.2638 1.2286 1.2228 1.4531 1.0866 1.0822 1.0594 1.0832 1.0522 1.0562 1.0876 1.0631 1.0477 1.0528 1.0720 1.0651 1.0909 10.4976 10.3880 1.0553 1.0567 1.1049 1.0595 1.0830 1.0359 1.0828 1.0664 1.0342 1.0565 1.0351 1.0954 1.0843 1.0560 1.0856 1.1008 1.1046 1.1033 1.1000 1.1010 1.1002 1.1014 1.1011 1.1004 1.1113 1.0651
irintensity: 0.4813 1.6756 0.3311 2.8207 0.9722 1.4571 0.1116 2.6553 0.6008 1.0128 3.0333 2.8892 1.5621 0.2543 1.9779 9.3690 1.6545 0.5374 0.0582 5.1796 1.8858 1.2326 2.6275 6.9443 13.7085 71.4462 6.0902 3.5960 92.0932 3.1790 31.0515 3.6383 2.4304 3.3548 4.1762 8.0571 3.6787 14.8135 15.9755 6.6214 7.7573 10.0979 1.1222 12.9939 0.2682 7.7074 1.8037 6.0996 8.0030 10.2225 8.7884 31.4759 5.5075 26.9202 44.9197 63.5095 20.8217 0.7385 72.7695 64.0607 85.9862 137.5230 80.0696 196.5487 127.0500 42.6629 35.2026 9.5294 18.0770 144.1748 77.0158 51.7580 6.2368 1.3169 14.4739 78.8182 4.1676 9.5389 0.6585 0.5891 6.0820 0.9590 1.3768 8.0499 11.1712 11.0604 12.9632 15.6396 16.8710 1.5471 25.8053 6.4433 19.9326 3.5566 8.3549 8.5730 20.2974 4.4494 16.1094 12.2820 14.4054 1.7848 11.2804 16.9538 2.8411 5.4330 9.5564 168.6630 175.6510 24.0515 118.8606 55.2950 50.6479 8.6050 30.0908 99.3297 23.3538 15.1562 41.9618 13.2505 31.2974 3.5128 21.0418 11.6090 3.5850 21.3501 34.4765 54.7800 77.5648 27.2163 21.1515 20.4273 13.6699 6.9092 16.4456
temp: 298.150 k
press: 1.00000 atm
elementType: 8 8 8 8 8 8 8 6 6 6 6 6 6 6 6 6 6 6 6 6 6 1 1 1 1 1 1 1 1 1 1 1 1 1 1 1 1 1 1 1 1 1 1 1 1 1 1
symmnumber: 1
zpe: 1026739.6 jmol-1
zpe.correction: 0.391064 hartree
zpe.thermalcorrener: 0.416443 hartree
zpe.thermalcorrenthalpy: 0.417387 hartree
zpe.thermalcorrgfe: 0.332137 hartree
zpe.sumelectzpe: -1073.908974 hartree
zpe.sumelectthermal: -1073.883596 hartree
zpe.sumelectthermalent: -1073.882652 hartree
zpe.sumelectthermalfe: -1073.967902 hartree
dipole: -3.8391 -0.0861 1.6501
dipole: 4.1795
quadrupole: -136.2404 -121.7601 -126.2549
quadrupole: -11.5081 8.0586 -5.8677
quadrupole: -8.1553 6.3251 1.8303 -11.5081 8.0586 -5.8677
hfenergy: -1074.3000388 hartree
pointgroup: C01 [X(C14H26O7)]
dipole: 1.5045479 -0.4994223 -0.4368399 debye
polarizability: 177.9302618|-25.0012336|188.1862932|3.5383411|19.7994495|168.279557 unknown
InChI: InChI=1S/C14H26O7/c1-4-5-6-18-7-8-19-9-10-20-14(17)12(3)21-13(16)11(2)15/h11-12,15H,4-10H2,1-3H3
charge 0 multiplicity 1
47 atoms
O  3.334304 -1.166643 0.527439
O  2.718373 -3.604883 -1.279323
O  -0.473887 -1.69626 -1.569886
O  -2.316825 1.471356 -1.574574
O  -4.311664 2.968031 1.09247
O  -0.206223 0.229427 -0.264752
O  -3.447242 0.488847 0.218756
C  2.689022 0.957556 1.527424
C  3.184182 -0.462478 1.813742
C  2.451946 1.763597 2.825969
C  3.876859 -2.518774 0.682064
C  3.991353 -3.151664 -0.705927
C  -1.920573 0.126613 -2.064694
C  1.830518 -2.554706 -1.804257
C  1.974555 3.204584 2.543407
C  0.629217 -2.416642 -0.855084
C  -0.773949 -0.399353 -1.179865
C  -1.512572 0.294247 -3.532438
C  -3.215948 2.936365 0.127608
C  -3.029086 1.50712 -0.381988
C  -1.892428 3.450303 0.743113
H  3.436069 1.475984 0.895049
H  1.751264 0.896625 0.945428
H  4.165192 -0.444175 2.341801
H  2.458694 -1.010793 2.45707
H  1.697218 1.242284 3.449623
H  3.386053 1.795632 3.424591
H  4.887976 -2.473439 1.149587
H  3.220073 -3.137788 1.332707
H  4.598077 -4.072084 -0.638589
H  4.495293 -2.436305 -1.388972
H  -2.776734 -0.564128 -1.955633
H  2.361596 -1.590088 -1.902843
H  1.482319 -2.898285 -2.795848
H  1.803881 3.765206 3.480847
H  2.72316 3.759871 1.947446
H  1.027606 3.200464 1.971859
H  0.215498 -3.409756 -0.619659
H  0.902667 -1.863746 0.057634
H  -0.674842 1.005554 -3.627414
H  -1.206189 -0.680654 -3.945616
H  -2.366644 0.678285 -4.114382
H  -3.515835 3.586247 -0.712439
H  -1.553326 2.780787 1.553021
H  -1.098528 3.505181 -0.021695
H  -2.069089 4.454242 1.16331
H  -4.365286 2.071036 1.521214
