program: Gaussian 09
title: 000254516
version: EM64L-G09RevD.01
frameworkgroup: C1[X(C13H14O2)]
method: RPBEPBE
basis: SDD
operation: Freq
keyword: #pfreq=noraman
keyword: PBEPBE/SDD
title: #p freq=noraman PBEPBE/SDD
converged: YES YES NO NO
title: Mulliken charges:
elementType: O O C C C C C C C C C C C C C H H H H H H H H H H H H H H
charge: -0.274499 -0.447185 0.135303 0.244166 0.435911 -0.274202 -0.401683 -0.390805 -0.372064 -0.456230 -0.422798 -0.239298 -0.312670 -0.237695 -0.239122 0.201975 0.202259 0.235451 0.235493 0.244708 0.269766 0.236089 0.236299 0.221773 0.186083 0.185567 0.227277 0.225541 0.344591
chargesum: 0.00000
title: Mulliken charges with hydrogens summed into heavy atoms:
elementType: O O C C C C C C C C C C C C C
charge: -0.274499 -0.102595 0.135303 0.244166 0.435911 0.130033 0.069261 -0.146097 -0.102298 -0.220141 -0.186499 -0.017525 0.058980 -0.010418 -0.013582
polarizability: 2.04694154e+02 -1.36200240e+01 1.76403095e+02 1.90038283e-01 4.03469942e-02 7.07689824e+01
1716.lowfreq: -13.6252 -7.4883 -0.0004 0.0004 0.0007 4.0941 33.7698 50.2256 61.7307
frequency: 33.7644 50.0662 61.7286 97.2682 133.8239 148.5589 187.2367 188.1331 227.0332 262.7790 287.1065 345.7555 419.4435 435.1276 468.5653 472.0168 503.8730 532.1264 572.7711 612.2867 642.5098 717.1641 739.6242 781.4170 782.8180 798.5857 808.2136 848.0321 861.2066 888.3469 893.4490 945.1609 961.0035 974.2617 990.0401 994.8878 1022.0787 1026.2715 1063.4060 1084.8609 1089.0665 1128.7045 1147.2675 1170.5358 1179.5902 1185.2023 1218.3047 1230.2521 1237.8977 1268.3293 1272.1886 1277.3296 1300.2129 1368.8682 1390.4093 1404.3037 1422.5421 1427.7791 1439.0904 1452.8747 1472.4856 1481.7165 1493.3034 1517.1209 1583.8022 1596.5811 1635.2106 2925.2429 2943.7924 2971.9829 2999.5246 3022.4503 3090.3859 3120.3060 3126.3063 3135.2151 3147.8008 3154.4517 3169.0253 3173.4581 3568.9489
redmass: 5.3361 2.0206 5.3418 3.3051 2.2098 4.4135 3.7023 4.2877 6.4144 4.3424 1.0816 4.2201 3.0928 4.1348 5.4355 3.3016 6.5097 6.1757 3.2492 6.3135 3.2080 6.2233 1.3158 1.5476 5.3147 1.2159 1.6680 5.1329 1.4290 1.3506 1.3961 8.1133 1.3311 1.3819 5.8547 1.3284 2.5042 2.5309 2.9360 2.5130 2.6051 1.5332 1.4283 1.0778 1.1520 1.2659 1.2681 1.8318 2.3253 1.7946 1.1724 1.1061 1.3146 1.8421 1.6965 2.9579 1.4664 5.9712 2.4354 2.4580 1.0802 1.0982 1.1059 3.7630 6.8900 5.7656 6.9770 1.0542 1.0551 1.1073 1.1068 1.0593 1.1051 1.0862 1.0859 1.0901 1.0943 1.0961 1.0956 1.0973 1.0665
irintensity: 0.2055 15.5211 1.1385 0.9024 0.3271 2.6273 1.0339 0.8429 0.3642 0.2407 164.4611 7.8812 7.0165 10.6280 9.2257 0.0313 6.2710 1.8664 11.1584 10.0889 0.8306 23.2086 2.5223 100.5632 0.3051 11.9915 52.5850 1.1934 0.0138 2.2805 1.3114 66.3041 0.0368 5.0937 60.2521 0.0244 19.3524 12.8294 63.8707 62.4116 9.1266 2.6652 5.9848 2.2072 0.0867 9.5791 28.5786 72.8605 89.9915 34.9430 0.3466 1.2269 17.6410 55.9710 5.7396 26.0667 10.5480 25.6173 6.2101 34.4288 3.0102 8.0106 5.7247 24.7569 76.4415 4.2269 4.3749 54.2781 59.5658 57.1460 39.9557 14.0753 37.8174 1.4890 1.3436 15.9936 33.2144 33.8518 22.8398 11.9178 2.9491
temp: 298.150 k
press: 1.00000 atm
elementType: 8 8 6 6 6 6 6 6 6 6 6 6 6 6 6 1 1 1 1 1 1 1 1 1 1 1 1 1 1
symmnumber: 1
zpe: 620877.8 jmol-1
zpe.correction: 0.236480 hartree
zpe.thermalcorrener: 0.250177 hartree
zpe.thermalcorrenthalpy: 0.251121 hartree
zpe.thermalcorrgfe: 0.194811 hartree
zpe.sumelectzpe: -653.126373 hartree
zpe.sumelectthermal: -653.112676 hartree
zpe.sumelectthermalent: -653.111732 hartree
zpe.sumelectthermalfe: -653.168041 hartree
dipole: -1.9900 2.6260 0.0005
dipole: 3.2949
quadrupole: -67.1627 -83.2127 -93.8442
quadrupole: -11.9917 0.0511 0.0089
quadrupole: 14.2438 -1.8061 -12.4377 -11.9917 0.0511 0.0089
hfenergy: -653.3628528 hartree
pointgroup: C01 [X(C13H14O2)]
dipole: 0.7366107 -1.058181 0.1344415 debye
polarizability: 203.3841008|-14.4013741|176.2743633|4.4505232|-12.0615999|72.2077674 unknown
InChI: InChI=1S/C13H14O2/c14-9-4-10-15-13-8-3-6-11-5-1-2-7-12(11)13/h1-3,5-8,14H,4,9-10H2
charge 0 multiplicity 1
29 atoms
O  1.181936 0.205841 0.100934
O  5.955249 0.780846 0.156589
C  -1.210978 0.356758 0.034091
C  -0.040735 -0.481253 0.151938
C  -2.515033 -0.26956 0.07701
C  2.420263 -0.580516 0.217983
C  3.580658 0.415106 0.139822
C  -0.160955 -1.868714 0.304163
C  -1.114879 1.776533 -0.122561
C  -2.613491 -1.693437 0.233764
C  -3.678432 0.561269 -0.039614
C  -1.459287 -2.467547 0.343952
C  4.941588 -0.280782 0.253525
C  -2.269458 2.557198 -0.233418
C  -3.56165 1.945162 -0.191661
H  2.420854 -1.127937 1.184538
H  2.46723 -1.321985 -0.607812
H  3.485723 1.158405 0.951357
H  3.534274 0.962807 -0.818266
H  0.721761 -2.507703 0.393584
H  -0.121789 2.233284 -0.15339
H  -3.60431 -2.160335 0.265231
H  -4.667358 0.088415 -0.007239
H  -1.534955 -3.554083 0.463112
H  5.021403 -0.816622 1.225393
H  5.065431 -1.023063 -0.566131
H  -2.187444 3.643158 -0.352722
H  -4.459689 2.566881 -0.27935
H  6.859569 0.382475 0.219178
