program: Gaussian 09
title: 000254524
version: EM64L-G09RevD.01
frameworkgroup: C1[X(C20H20O2)]
method: RPBEPBE
basis: SDD
operation: Freq
keyword: #pfreq=noraman
keyword: PBEPBE/SDD
title: #p freq=noraman PBEPBE/SDD
converged: YES YES NO NO
title: Mulliken charges:
elementType: O O C C C C C C C C C C C C C C C C C C C C H H H H H H H H H H H H H H H H H H H H
charge: -0.188091 -0.209319 -0.203218 -0.242270 -0.468914 -0.432249 -0.505531 0.097564 -0.621582 0.516969 0.147175 -0.385856 -0.442120 0.284869 -0.256439 -0.228751 -0.246665 -0.342116 -0.347838 -0.249226 -0.231109 -0.224498 0.271377 0.274386 0.209650 0.252974 0.226463 0.213470 0.238609 0.255073 0.259175 0.230770 0.215993 0.241414 0.221755 0.224595 0.226402 0.242762 0.278330 0.229278 0.233579 0.233161
chargesum: 0.00000
title: Mulliken charges with hydrogens summed into heavy atoms:
elementType: O O C C C C C C C C C C C C C C C C C C C C
charge: -0.188091 -0.209319 0.068159 0.032116 -0.006291 0.007684 -0.011848 0.097564 -0.131637 0.516969 0.147175 -0.169863 -0.200705 0.284869 -0.034684 -0.004156 -0.020263 -0.099354 -0.069508 -0.019948 0.002469 0.008663
polarizability: 2.25123364e+02 -1.07582145e+01 2.18345949e+02 -7.94036015e+00 1.97305755e+01 1.86136234e+02
1716.lowfreq: -5.2314 -3.4124 -0.0009 -0.0006 -0.0004 7.3611 20.4252 26.8203 35.1570
frequency: 20.3699 26.5899 34.9918 40.6583 55.7343 61.6204 77.7802 89.3415 146.2558 163.6057 172.1368 207.0760 215.0041 225.1820 248.5477 310.1225 360.9939 399.8108 403.9621 413.6716 418.1804 460.4269 492.2500 523.0388 550.9969 561.6184 587.6685 602.7282 613.4236 619.0061 622.5087 661.8468 696.7858 704.8487 722.5369 755.4635 773.5368 782.3288 810.8305 835.3967 850.6442 858.3007 875.1263 910.7143 920.5203 928.2985 939.7882 961.0122 968.1962 973.8318 989.6324 990.5082 990.8546 993.0370 995.3119 1011.2746 1022.3041 1028.3458 1030.9721 1044.7715 1082.3359 1085.7182 1114.6248 1129.7741 1150.8903 1156.8320 1171.3057 1173.1952 1182.3777 1187.9329 1191.5181 1201.4248 1205.7802 1218.2904 1250.0344 1258.6929 1271.8839 1293.3531 1296.4580 1310.8889 1313.8398 1322.5387 1336.7183 1365.1449 1387.1308 1387.3759 1426.3345 1430.5291 1436.1835 1442.5981 1474.3754 1479.0203 1481.4501 1484.5505 1572.5909 1592.2861 1599.7657 1613.1829 1614.0881 1650.9346 2932.7989 2970.1512 2987.4776 2990.4776 3004.7226 3013.0394 3036.4492 3065.9643 3073.8031 3082.9249 3112.4426 3122.4898 3127.9651 3133.5196 3137.9006 3143.7335 3149.3181 3158.7126 3161.3857 3169.2984
redmass: 6.0638 3.8629 3.9829 5.1207 3.7002 6.5522 5.0707 3.3371 5.3856 3.6433 4.8208 3.8327 2.2552 3.5560 3.8953 5.9187 3.2002 2.8093 2.8162 3.1558 4.1881 5.0126 4.4945 2.8672 2.5212 3.4052 2.7644 4.5001 6.2718 3.8417 5.7347 5.0207 1.8099 1.8510 2.2544 2.2656 2.5862 2.4277 2.8018 2.3164 1.2520 1.2526 1.9185 1.9746 1.5154 2.0598 1.6115 2.4398 1.8021 1.4036 4.6294 1.6829 2.6485 1.5235 2.4475 1.3648 2.2243 2.1321 1.9757 2.0846 1.6250 1.6050 3.0166 1.7500 2.2627 1.4652 1.0605 1.0679 1.3807 1.1528 1.1485 1.4192 2.2742 1.8785 1.3422 1.6763 1.3416 1.6249 1.4189 1.4484 1.4673 1.4921 1.4215 1.7045 4.0576 7.0949 1.0797 1.1607 2.0888 2.0711 1.0854 2.1703 1.1149 2.2500 6.7772 5.9438 6.8080 6.2805 6.5663 12.3007 1.0800 1.0624 1.0653 1.0661 1.0633 1.0841 1.0936 1.0955 1.0980 1.1030 1.0858 1.0861 1.0850 1.0917 1.0880 1.0960 1.0924 1.0960 1.1015 1.1012
irintensity: 0.8387 0.2049 0.5042 2.4710 0.4939 2.6756 0.3242 3.3037 1.5011 2.5643 2.3081 7.7570 1.7524 0.6299 0.3010 6.0327 2.2346 0.0553 0.0153 0.7622 0.4664 2.8957 5.9975 13.1523 7.3172 21.8787 13.0939 4.7806 0.7384 2.2407 1.6578 5.8673 46.4115 48.9669 26.3397 45.4296 12.4650 21.4559 10.0443 9.2129 0.3374 0.6006 7.4437 6.2038 0.7199 23.6879 2.3472 25.6775 1.8319 0.1991 0.2979 1.6189 5.7752 5.8315 20.5372 0.7773 9.1877 4.3981 1.1031 3.3713 11.9920 6.5262 32.9426 5.4234 31.8242 30.7440 0.3386 3.5262 6.1008 32.2736 2.1062 9.0209 23.7525 41.4647 25.5125 61.2591 7.9377 49.7533 6.6005 11.3142 2.7755 42.8969 13.4799 6.4409 1.1614 2.2420 21.2790 12.7662 23.6856 10.8168 8.6714 0.3348 5.9207 15.9320 76.6393 2.5862 40.7110 7.1508 14.8967 153.9268 11.7354 22.0022 12.4062 29.7937 41.4545 1.1302 13.2749 15.4793 21.6619 45.3407 11.7953 0.2213 0.3682 21.6855 6.4300 37.5657 21.3689 19.9398 24.3989 22.6359
temp: 298.150 k
press: 1.00000 atm
elementType: 8 8 6 6 6 6 6 6 6 6 6 6 6 6 6 6 6 6 6 6 6 6 1 1 1 1 1 1 1 1 1 1 1 1 1 1 1 1 1 1 1 1
symmnumber: 1
zpe: 901211.8 jmol-1
zpe.correction: 0.343253 hartree
zpe.thermalcorrener: 0.362733 hartree
zpe.thermalcorrenthalpy: 0.363677 hartree
zpe.thermalcorrgfe: 0.292234 hartree
zpe.sumelectzpe: -923.003500 hartree
zpe.sumelectthermal: -922.984021 hartree
zpe.sumelectthermalent: -922.983077 hartree
zpe.sumelectthermalfe: -923.054520 hartree
dipole: 0.0178 -1.3001 -4.8321
dipole: 5.0040
quadrupole: -109.8855 -125.3906 -133.5438
quadrupole: -0.8682 -1.1008 10.1124
quadrupole: 13.0544 -2.4506 -10.6039 -0.8682 -1.1008 10.1124
hfenergy: -923.3467536 hartree
pointgroup: C01 [X(C20H20O2)]
dipole: -0.0831516 0.4890667 -1.9052121 debye
polarizability: 223.1201166|-12.6649115|220.5462116|3.0326897|-20.0317619|185.939219 unknown
InChI: InChI=1S/C20H20O2/c21-19-13-7-12-17(19)18(15-8-3-1-4-9-15)14-20(22)16-10-5-2-6-11-16/h1-6,8-11,17-18H,7,12-14H2
charge 0 multiplicity 1
42 atoms
O  2.15014 2.41338 1.800764
O  -1.207162 -0.686848 1.780641
C  2.417835 0.757772 -0.041829
C  1.179419 -0.061186 0.429106
C  2.611815 1.078531 -1.54756
C  3.62808 2.257268 -1.546774
C  3.196183 3.126328 -0.338894
C  2.538394 2.139802 0.639202
C  -0.1518 0.593915 -0.009948
C  1.295907 -1.529234 0.006725
C  -1.361237 0.064588 0.77487
C  1.091151 -1.945976 -1.334888
C  1.656274 -2.509897 0.965391
C  -2.740635 0.478728 0.337393
C  1.246113 -3.29994 -1.707319
C  1.817353 -3.864431 0.598091
C  1.613857 -4.265643 -0.742436
C  -2.966501 1.393933 -0.726291
C  -3.857531 -0.064346 1.029335
C  -4.281251 1.756888 -1.08931
C  -5.169566 0.294322 0.664363
C  -5.385303 1.206966 -0.397077
H  3.319923 0.194472 0.291964
H  1.194215 -0.027966 1.535381
H  1.656011 1.411013 -1.998337
H  2.970141 0.208731 -2.121746
H  3.629702 2.815867 -2.498096
H  4.651543 1.86796 -1.387387
H  2.428063 3.870712 -0.632253
H  4.010416 3.687406 0.151581
H  -0.10555 1.689638 0.162555
H  -0.336051 0.457172 -1.092211
H  0.801916 -1.214579 -2.099901
H  1.789932 -2.208068 2.010804
H  1.079295 -3.601685 -2.747929
H  2.088918 -4.606451 1.357574
H  1.73234 -5.316575 -1.029514
H  -2.122473 1.83183 -1.269352
H  -3.662715 -0.764284 1.848723
H  -4.446936 2.465944 -1.907845
H  -6.023568 -0.131878 1.201963
H  -6.405654 1.48792 -0.681323
