program: Gaussian 09
title: 000254515
version: EM64L-G09RevD.01
frameworkgroup: C1[X(C13H9Cl3O)]
method: RPBEPBE
basis: SDD
operation: Freq
keyword: #p
keyword: freq=noraman
keyword: PBEPBE/SDD
title: #p freq=noraman PBEPBE/SDD
converged: YES YES NO NO
title: Mulliken charges:
elementType: Cl Cl Cl O C C C C C C C C C C C C C H H H H H H H H H
charge: -0.025769 -0.027071 -0.023197 -0.262840 0.657969 -0.406556 -0.278823 -0.280891 0.370584 -0.232969 -0.232754 -0.083517 -0.340378 -0.369918 -0.228030 -0.197795 -0.254209 0.230800 0.230252 0.287754 0.287887 0.247962 0.251147 0.223765 0.228123 0.228473
chargesum: 0.00000
title: Mulliken charges with hydrogens summed into heavy atoms:
elementType: Cl Cl Cl O C C C C C C C C C C C C C
charge: -0.025769 -0.027071 -0.023197 -0.262840 0.657969 0.054496 -0.278823 -0.280891 0.370584 0.054786 0.055132 -0.083517 -0.092416 -0.118771 -0.004265 0.030328 -0.025735
polarizability: 2.56229508e+02 1.71464482e-01 1.47495772e+02 1.44931887e+01 -5.01583913e-01 1.16282233e+02
1716.lowfreq: -9.3194 -6.8088 -0.0023 -0.0014 0.0017 5.5313 8.5612 30.1027 32.1100
frequency: 7.6006 30.0895 32.0911 80.7106 96.7730 134.6487 149.6223 175.7149 194.0484 209.0772 229.5806 311.4840 321.6857 345.8406 410.4826 410.5687 410.9981 432.0953 499.5246 502.0468 517.7719 542.3236 577.7631 609.4898 687.8700 691.2145 727.6963 742.0069 757.8616 802.1298 821.0663 854.2596 858.5562 865.9382 889.2694 946.7922 960.2935 982.7052 983.7474 988.7620 1022.0701 1051.1095 1083.2185 1111.6155 1166.9803 1174.7605 1177.1980 1207.9050 1221.4892 1227.9809 1314.4596 1363.8228 1368.2956 1369.0361 1389.7787 1435.4202 1443.7604 1469.9080 1480.4465 1556.2827 1585.5137 1591.7668 1610.6893 2988.8392 3049.8270 3128.5763 3137.5199 3154.8635 3163.5906 3173.3694 3189.9270 3191.5983
redmass: 8.3322 12.6790 4.7263 5.9016 9.3156 7.7315 10.3410 23.7021 4.7180 17.4657 4.9434 7.0864 3.0059 32.8695 6.7442 3.3390 7.7123 5.6472 3.3607 3.2280 5.1765 6.0628 5.1756 6.4164 5.1946 2.0593 7.4551 8.8445 1.6614 7.4500 1.2535 5.4554 1.4557 1.3641 1.4468 9.0202 1.3679 1.3144 6.1129 1.5761 2.0795 3.0248 1.5201 3.2169 1.1099 1.4154 1.2205 2.8355 2.7327 1.1513 1.3308 3.3773 1.4986 6.2263 4.3693 3.3279 2.4266 1.3282 1.6812 8.8192 8.8292 6.4235 6.3227 1.0560 1.1069 1.0847 1.0889 1.0924 1.0958 1.1005 1.0934 1.0943
irintensity: 0.0001 0.0744 0.2772 1.5949 0.0135 0.0574 0.2167 0.4226 0.0045 0.7230 0.4835 2.4998 4.3941 0.0403 12.9604 2.9786 6.4747 2.1625 8.0799 3.9646 0.0020 7.4216 14.2541 1.1348 8.0796 28.2476 23.5953 50.1609 108.0022 1.1118 0.0314 77.3979 49.3313 0.0578 8.0913 96.4548 0.1331 2.2978 1.8734 15.2660 18.0035 5.2319 13.4000 19.1933 22.4562 14.3775 68.2104 243.1713 5.9716 1.9442 2.7747 35.5590 23.4975 11.9187 30.5248 22.4436 5.6095 106.8244 45.0950 100.9059 135.8839 58.2317 69.3705 27.2574 7.1149 3.9700 11.5718 37.7525 18.9058 6.6548 2.9407 0.8161
temp: 298.150 k
press: 1.00000 atm
elementType: 17 17 17 8 6 6 6 6 6 6 6 6 6 6 6 6 6 1 1 1 1 1 1 1 1 1
symmnumber: 1
zpe: 474880.5 jmol-1
zpe.correction: 0.180872 hartree
zpe.thermalcorrener: 0.196388 hartree
zpe.thermalcorrenthalpy: 0.197332 hartree
zpe.thermalcorrgfe: 0.133986 hartree
zpe.sumelectzpe: -1954.969444 hartree
zpe.sumelectthermal: -1954.953929 hartree
zpe.sumelectthermalent: -1954.952985 hartree
zpe.sumelectthermalfe: -1955.016331 hartree
dipole: 0.0396 0.0105 -1.3203
dipole: 1.3210
quadrupole: -112.8674 -122.0763 -114.2187
quadrupole: 0.0168 1.2776 -0.1902
quadrupole: 3.5201 -5.6889 2.1688 0.0168 1.2776 -0.1902
hfenergy: -1955.1503168 hartree
pointgroup: C01 [X(C13H9Cl3O1)]
dipole: -0.0386398 -0.0034155 -0.5182545 debye
dipolederiv: -0.2516171 -0.2360394 0.0627165 -0.230611 -0.617454 0.0818457 0.0753963 0.084481 -0.0628727 -0.2422215 0.2289792 0.0581866 0.2217079 -0.6306099 -0.0764818 0.0708143 -0.0789503 -0.0614786 -0.8395404 0.0078324 0.2144695 0.0087817 -0.1262562 -0.0021633 0.2463719 -0.0022823 -0.1140249 -2.1120105 -0.0017042 -0.1527276 -0.0038452 -0.2273868 -0.0003977 -0.2011732 -0.0005111 -0.2988937 -0.1894215 -0.0018132 0.0472154 -0.0018731 -0.5246204 0.0010625 0.1242312 0.000577 -0.0482088 1.0562981 -0.0019651 0.0893413 0.0011147 0.2521905 0.0023845 0.5436538 0.0012888 0.4295942 0.4907218 0.3451489 -0.1508722 0.1874234 0.9741954 -0.1035492 -0.1422932 -0.1101839 -0.0049855 0.4781034 -0.3364208 -0.1449967 -0.1751858 0.9915433 0.0946602 -0.1402968 0.1017178 -0.0068578 1.8367376 0.0020663 0.082613 0.0010541 0.1094186 -0.0012321 -0.2196988 -0.0002117 0.0552392 -0.5313224 -0.1820007 0.1249409 -0.150285 -0.2790057 0.0476563 0.1344272 0.0621331 -0.1092285 -0.5252444 0.1869944 0.1218607 0.1573349 -0.28867 -0.0480012 0.1321232 -0.0621332 -0.107975 1.267257 -0.0103701 -0.3737114 -0.0123425 0.3556407 0.0023101 -0.4044577 0.0023556 0.0682433 -0.3985461 -0.0002171 -0.0362177 0.0059925 -0.2004381 0.0027802 0.3430842 0.0029642 -0.0452697 -0.4578658 0.0001364 -0.0142838 -0.0043299 -0.1745899 0.003547 -0.2398972 0.0024709 0.0105037 0.1523744 0.0014804 0.0592637 -0.0005946 -0.1383738 0.0052262 -0.0701041 0.0048373 0.1546117 0.1775861 0.0004357 -0.0214647 0.0006553 -0.1405955 0.0050626 0.0000259 0.0053232 0.1572246 -0.045731 0.0002105 -0.0322817 0.0006962 -0.1957436 -0.0003922 0.0194682 -0.0001625 -0.2145512 -0.0087476 0.0337057 0.0209491 0.0421507 -0.0210788 -0.1089668 -0.1395749 -0.044759 -0.0112974 -0.0118082 -0.0334246 0.0250574 -0.0440615 -0.0158037 0.1098568 -0.138795 0.0458635 -0.0165866 0.0871152 0.0261927 0.0235796 0.0314053 0.0490184 -0.0084222 0.0282681 -0.0089163 0.1654412 0.0858894 -0.0268769 0.0240902 -0.0318392 0.0505506 0.0090767 0.0290339 0.009391 0.1653275 0.0312941 -0.0021719 -0.1011911 -0.0029544 0.1589431 -0.0034183 -0.1316253 -0.0032916 -0.0264611 0.0671899 0.0010864 0.0802345 0.0010288 0.1621147 -0.0031122 0.0768195 -0.0028394 -0.0169776 0.0204988 0.0010952 0.0796631 0.0014698 0.1524263 -0.0038851 0.1054762 -0.0037986 -0.0801076 0.0061514 -0.0018009 -0.0952523 -0.0022397 0.153486 -0.0040296 -0.1080093 -0.0039602 -0.0666073 -0.1431407 -0.0005594 0.0088175 -0.0006534 0.1710989 -0.001417 0.0067317 -0.001403 0.0861985 unknown
polarizability: 254.6665539|0.0177095|147.4940929|-20.6482135|0.5680014|117.8468662 unknown
InChI: InChI=1S/C13H9Cl3O/c14-9-6-12(15)11(13(16)7-9)8-17-10-4-2-1-3-5-10/h1-7H,8H2
charge 0 multiplicity 1
26 atoms
Cl -1.152061 2.796274 -0.4949
Cl -1.212198 -2.814616 -0.46273
Cl -5.725645 0.047221 0.935936
O  0.985348 -0.003891 0.334213
C  -1.279698 -0.00755 -0.460969
C  0.163948 -0.023611 -0.896484
C  -1.989482 1.201013 -0.238619
C  -2.01491 -1.197886 -0.225299
C  2.384797 -0.003646 0.163709
C  -3.332144 1.249355 0.182089
C  -3.358398 -1.213116 0.195359
C  -3.994693 0.026106 0.392449
C  3.041222 -0.023669 -1.091731
C  3.134492 0.018507 1.366207
C  4.455863 -0.020825 -1.130012
C  4.541627 0.02086 1.309581
C  5.212527 0.001311 0.06119
H  0.385958 -0.939881 -1.475142
H  0.39467 0.868016 -1.50955
H  -3.837994 2.203789 0.341454
H  -3.8845 -2.154711 0.364685
H  2.478593 -0.041407 -2.029942
H  2.597962 0.033668 2.319883
H  4.96325 -0.036293 -2.101285
H  5.116757 0.038139 2.242048
H  6.30671 0.003341 0.021358
