program: Gaussian 09
title: 000254514
version: EM64L-G09RevD.01
frameworkgroup: C1[X(C12H13ClO3)]
method: RPBEPBE
basis: SDD
operation: Freq
keyword: #p
keyword: freq=noraman
keyword: PBEPBE/SDD
title: #p freq=noraman PBEPBE/SDD
converged: YES YES NO NO
title: Mulliken charges:
elementType: Cl O O O C C C C C C C C C C C C H H H H H H H H H H H H H
charge: -0.067265 -0.248565 -0.228419 -0.245716 0.387869 -0.423489 -0.310973 -0.363629 -0.372386 0.261818 -0.218539 -0.182947 -0.120917 -0.155864 -0.123534 -0.730632 0.262847 0.236536 0.254029 0.258547 0.228561 0.233995 0.253758 0.256698 0.241627 0.229486 0.228470 0.229598 0.229035
chargesum: 0.00000
title: Mulliken charges with hydrogens summed into heavy atoms:
elementType: Cl O O O C C C C C C C C C C C C
charge: -0.067265 -0.248565 -0.228419 -0.245716 0.387869 0.075895 -0.056943 -0.105082 0.090171 0.261818 0.035219 0.073751 -0.120917 0.085763 0.105952 -0.043529
polarizability: 1.64521366e+02 -2.24443728e+01 1.55737660e+02 -1.94337196e+01 -1.86234548e+01 1.13905284e+02
1716.lowfreq: -17.4616 -15.8024 -3.8093 -0.0021 -0.0018 -0.0017 5.6096 20.1009 40.6467
frequency: -17.0558 19.9696 40.5360 55.7205 63.0770 91.7077 112.1419 175.8097 185.7680 198.0617 204.3894 241.7325 283.6446 311.0445 324.8014 332.8157 380.4046 414.2027 415.9786 495.8539 498.9374 543.1152 562.9349 604.9301 623.6282 657.6959 694.6913 747.9644 771.7478 803.0145 807.4357 823.1830 878.7090 906.0785 929.6509 952.6921 977.3922 982.4986 988.7377 1004.5819 1009.9761 1047.3722 1070.4574 1096.3243 1109.3767 1150.0433 1174.7688 1180.6593 1221.0942 1228.4018 1248.4211 1289.7760 1291.3848 1308.7390 1341.6053 1347.1406 1372.5796 1393.5041 1402.5829 1449.3643 1452.4836 1459.7041 1468.0923 1471.8242 1585.7292 1603.3065 1622.1278 1686.0621 2970.2912 3006.8752 3033.7032 3045.2798 3079.5918 3081.9439 3100.1283 3104.7243 3122.6636 3152.9124 3160.0425 3173.4045 3180.1672
redmass: 4.1545 5.9737 4.0404 4.6864 8.6051 2.7481 2.5730 4.0695 3.4390 1.5931 4.3713 4.2228 3.1172 4.1267 3.5175 7.0637 4.4005 3.0762 5.0677 2.8198 2.7395 6.2552 3.5682 6.4043 6.9901 4.5221 3.5900 2.9194 4.9994 1.3187 2.1286 1.5244 3.6363 2.3952 1.3333 1.3426 1.3324 1.1993 3.8650 2.1968 6.2438 1.5767 2.5547 3.7880 1.3199 2.2827 1.4018 2.2788 3.8275 1.1994 1.2325 1.2587 1.2536 1.2459 1.2706 1.3148 5.7874 1.2377 3.7439 1.0864 1.1063 1.0476 1.0595 2.3736 7.2053 6.8509 9.9493 5.9308 1.0367 1.0609 1.0578 1.0965 1.0956 1.1012 1.0974 1.0996 1.0973 1.0883 1.0885 1.0966 1.0978
irintensity: 0.2557 0.4232 0.1135 0.4502 1.8435 0.1776 0.1491 1.9256 1.1787 0.6696 2.8623 4.8267 8.3766 2.8753 16.4009 2.1606 7.2667 0.8543 7.4778 11.2192 11.1879 6.1425 0.6624 47.5717 5.3017 4.4846 0.2612 14.9475 0.7053 20.5642 3.4966 79.3221 98.3324 31.4477 0.0113 0.1164 69.8499 22.7649 23.8975 11.2536 72.4589 0.0363 36.3233 5.8203 12.5629 5.8002 78.5625 120.6297 186.4458 20.9969 65.0839 1.7498 3.6999 2.8099 3.4373 7.3481 6.5750 14.8252 0.0289 11.6651 20.7470 17.5625 24.7200 187.0089 9.2980 15.1285 149.7988 19.6026 22.2751 29.2858 33.8292 22.2209 6.4583 6.7093 16.7562 10.7376 23.5756 7.5202 1.9811 5.2256 1.7200
temp: 298.150 k
press: 1.00000 atm
elementType: 17 8 8 8 6 6 6 6 6 6 6 6 6 6 6 6 1 1 1 1 1 1 1 1 1 1 1 1 1
symmnumber: 1
zpe: 582592.8 jmol-1
zpe.correction: 0.221898 hartree
zpe.thermalcorrener: 0.237419 hartree
zpe.thermalcorrenthalpy: 0.238363 hartree
zpe.thermalcorrgfe: 0.176910 hartree
zpe.sumelectzpe: -1149.584488 hartree
zpe.sumelectthermal: -1149.568967 hartree
zpe.sumelectthermalent: -1149.568023 hartree
zpe.sumelectthermalfe: -1149.629476 hartree
dipole: 1.9471 0.4717 0.5095
dipole: 2.0672
quadrupole: -106.6493 -93.9115 -99.4193
quadrupole: 6.1736 1.6216 -1.2713
quadrupole: -6.6559 6.0818 0.5741 6.1736 1.6216 -1.2713
hfenergy: -1149.806386 hartree
pointgroup: C01 [X(C12H13Cl1O3)]
dipole: -0.7543651 0.2828711 0.1113469 debye
polarizability: 126.081011|-19.980068|174.8774157|24.7839162|15.8616943|133.2058834 unknown
InChI: InChI=1S/C12H13ClO3/c1-2-3-8-15-12(14)9-16-11-6-4-10(13)5-7-11/h2-7H,8-9H2,1H3
charge 0 multiplicity 1
29 atoms
Cl 2.196432 -3.797388 -0.59031
O  0.998139 1.852119 1.153384
O  -1.753909 1.740194 1.196684
O  -1.917373 2.913594 -0.820046
C  1.220464 0.548921 0.670328
C  0.251469 2.774205 0.309138
C  0.768723 0.063475 -0.581282
C  1.966735 -0.28749 1.536112
C  -3.21567 1.341457 1.097189
C  -1.248086 2.474599 0.144733
C  1.069908 -1.265055 -0.962909
C  2.265989 -1.610094 1.156342
C  1.81247 -2.082027 -0.093295
C  -3.359957 0.054788 0.331945
C  -3.991288 -0.024903 -0.869604
C  -4.17999 -1.291815 -1.667516
H  0.35033 3.752021 0.811286
H  0.689496 2.855835 -0.704038
H  0.182005 0.683954 -1.265043
H  2.301062 0.111678 2.497917
H  -3.497384 1.240642 2.157454
H  -3.770784 2.167429 0.620315
H  0.725436 -1.650129 -1.926984
H  2.841943 -2.260691 1.820547
H  -2.92148 -0.842167 0.790171
H  -4.396089 0.899146 -1.310197
H  -5.254928 -1.501529 -1.831304
H  -3.721371 -1.194922 -2.670769
H  -3.730391 -2.164352 -1.162949
