program: Gaussian 09
title: 000254512
version: EM64L-G09RevD.01
frameworkgroup: C1[X(C11H20O6)]
method: RPBEPBE
basis: SDD
operation: Freq
keyword: #pfreq=noraman
keyword: PBEPBE/SDD
title: #p freq=noraman PBEPBE/SDD
converged: YES YES NO NO
title: Mulliken charges:
elementType: O O O O O O C C C C C C C C C C C H H H H H H H H H H H H H H H H H H H H
charge: -0.244676 -0.244651 -0.453222 -0.453275 -0.260783 -0.260846 -0.369523 -0.375195 -0.375243 -0.319226 -0.319199 -0.126541 -0.126401 0.210647 0.210554 -0.663315 -0.663254 0.201320 0.201450 0.237220 0.219669 0.237154 0.219745 0.231902 0.233262 0.231950 0.233219 0.240695 0.240650 0.219764 0.225105 0.248209 0.219755 0.225078 0.248195 0.359887 0.359919
chargesum: 0.00000
title: Mulliken charges with hydrogens summed into heavy atoms:
elementType: O O O O O O C C C C C C C C C C C
charge: -0.244676 -0.244651 -0.093335 -0.093356 -0.260783 -0.260846 0.033247 0.081694 0.081656 0.145938 0.145970 0.114153 0.114249 0.210647 0.210554 0.029763 0.029774
polarizability: 1.80075164e+02 -1.95789843e-02 1.13939444e+02 7.84633293e-01 -3.95552922e-01 1.29820279e+02
1716.lowfreq: -10.4401 -3.8315 -0.0004 0.0001 0.0006 3.6358 13.8830 19.9834 26.7654
frequency: 12.8941 19.9498 26.3937 34.1031 46.6382 51.4389 52.8444 81.1422 102.7332 122.7819 129.3988 147.9163 185.5492 218.0230 221.4461 244.4556 252.2970 289.1229 290.6437 317.5292 319.5385 339.6836 344.6413 358.7710 389.1218 424.0314 439.4964 505.9197 551.7378 619.9274 620.3054 705.3456 705.6536 746.3184 766.3208 788.3269 805.0444 856.2826 875.8305 878.0615 925.6422 927.7357 973.0006 1016.4764 1017.6516 1023.4827 1035.6640 1070.6646 1071.7173 1074.3338 1091.1005 1098.7432 1104.0423 1160.0274 1169.5749 1172.0033 1194.7569 1238.5552 1240.0565 1240.2887 1255.6314 1285.4296 1298.4165 1300.2705 1305.5331 1307.3654 1308.0891 1354.4682 1367.3509 1370.3873 1377.1986 1378.2722 1385.1914 1386.3456 1454.4139 1455.3462 1464.3062 1464.8586 1469.5693 1474.1653 1474.7068 1475.2532 1487.1690 1615.9885 1616.1454 2962.6345 2994.8408 2995.1538 2995.2925 2999.4182 3009.6549 3023.5457 3024.2396 3031.1515 3031.4627 3053.2375 3063.9125 3099.0887 3099.6478 3106.2355 3107.4315 3109.8269 3109.9466 3479.4819 3480.3564
redmass: 4.5570 4.5760 3.9979 4.7506 4.9658 4.7185 7.7805 2.6034 2.4771 3.6666 2.4370 4.1899 3.1711 1.7683 1.6741 1.4405 1.5933 3.6375 3.4294 1.8830 1.8662 1.9695 2.4889 5.4820 2.7869 2.7127 3.4233 4.2156 4.3391 4.6776 4.6532 4.2297 4.3185 1.0694 1.2723 2.5609 2.6779 1.4605 4.2306 3.9451 3.2186 3.2837 1.2605 2.0526 2.0088 4.3716 4.2099 2.6626 2.6409 2.4014 3.2554 2.1239 2.3740 1.8532 2.6102 2.4650 1.3974 1.4272 1.4851 1.3063 1.2678 1.0812 1.1405 1.1024 1.2598 1.2579 1.2624 1.3601 1.3698 1.2854 1.3062 1.2876 1.3136 1.3259 1.0974 1.1020 1.0645 1.0656 1.0679 1.0626 1.0730 1.0622 1.1006 8.8282 8.7830 1.0586 1.0346 1.0347 1.0598 1.0593 1.1006 1.0584 1.0583 1.0848 1.0848 1.1033 1.1041 1.1007 1.1008 1.1087 1.1083 1.1007 1.1007 1.0651 1.0651
irintensity: 3.1756 2.0571 1.0390 0.1693 8.9177 0.2593 0.3158 1.0386 0.1741 1.6848 0.4692 0.1464 11.4171 0.3126 1.8235 0.0788 0.8867 0.3532 0.8023 253.2391 12.1508 45.3320 62.9143 22.4341 0.3684 4.7979 5.3608 0.9011 2.9140 25.2910 4.0714 9.8133 8.3019 9.4813 2.2460 6.1325 6.4036 3.2355 0.0557 20.7071 11.2204 37.5350 0.5846 71.3858 22.5369 35.0249 0.2994 92.6282 72.9427 2.0627 40.2450 337.4196 21.1505 1.9627 363.3444 35.7230 3.2241 150.6145 49.1718 24.2464 30.9053 1.9431 0.2100 1.2648 0.2525 1.4345 0.9540 0.8327 8.8163 7.5995 36.9865 1.3805 23.5910 14.5072 6.1482 7.9497 17.3174 16.4289 0.0008 14.8606 0.3504 12.6298 24.4497 230.5614 58.4693 22.1690 16.1376 15.3766 1.0219 24.1860 10.4888 4.6100 71.1920 18.8480 17.4283 0.4333 29.8652 29.5807 29.8807 0.7509 47.8668 18.6977 18.6958 25.3858 25.0924
temp: 298.150 k
press: 1.00000 atm
elementType: 8 8 8 8 8 8 6 6 6 6 6 6 6 6 6 6 6 1 1 1 1 1 1 1 1 1 1 1 1 1 1 1 1 1 1 1 1
symmnumber: 1
zpe: 799354.3 jmol-1
zpe.correction: 0.304458 hartree
zpe.thermalcorrener: 0.325332 hartree
zpe.thermalcorrenthalpy: 0.326276 hartree
zpe.thermalcorrgfe: 0.250012 hartree
zpe.sumelectzpe: -881.130488 hartree
zpe.sumelectthermal: -881.109614 hartree
zpe.sumelectthermalent: -881.108670 hartree
zpe.sumelectthermalfe: -881.184934 hartree
dipole: -0.0031 -3.8716 -0.0846
dipole: 3.8725
quadrupole: -129.8082 -105.8351 -105.3342
quadrupole: 0.3995 -17.5177 -0.0023
quadrupole: -16.1490 7.8241 8.3250 0.3995 -17.5177 -0.0023
hfenergy: -881.4349458 hartree
pointgroup: C01 [X(C11H20O6)]
dipole: 0.0010628 1.5235402 0.0102262 debye
polarizability: 180.0638298|-0.005065|113.9298086|1.0887344|-0.0578463|129.8412487 unknown
InChI: InChI=1S/C11H20O6/c1-8(12)10(14)16-6-4-3-5-7-17-11(15)9(2)13/h8-9,12-13H,3-7H2,1-2H3
charge 0 multiplicity 1
37 atoms
O  -3.636623 -0.087467 -1.005904
O  3.641766 -0.097037 1.016344
O  -6.224244 -2.01481 0.722628
O  6.224556 -2.006155 -0.739764
O  -4.213235 -0.229789 1.254008
O  4.211733 -0.216686 -1.246542
C  0.001672 0.753564 0.012342
C  -1.239277 -0.111605 -0.31096
C  1.242722 -0.114502 0.327249
C  -2.450367 0.761985 -0.661079
C  2.45453 0.755767 0.683178
C  -5.616711 -1.349546 -0.42581
C  5.619688 -1.35397 0.417561
C  -4.422537 -0.513753 0.046902
C  4.424522 -0.512865 -0.042972
C  -6.646389 -0.468472 -1.170558
C  6.651367 -0.481546 1.16971
H  0.226665 1.419408 -0.846226
H  -0.223382 1.411321 0.877099
H  -1.488045 -0.744443 0.561329
H  -1.015948 -0.785572 -1.15976
H  1.490398 -0.739947 -0.550687
H  1.020193 -0.795663 1.170487
H  -2.282077 1.354647 -1.574937
H  -2.724744 1.422393 0.181376
H  2.288602 1.339256 1.603336
H  2.726649 1.424519 -0.153395
H  -5.246896 -2.138969 -1.104927
H  5.251265 -2.150877 1.088663
H  -6.990365 0.361872 -0.528642
H  -6.213837 -0.053858 -2.097855
H  -7.519119 -1.091944 -1.425862
H  6.993786 0.356003 0.536395
H  6.221324 -0.077527 2.102836
H  7.524655 -1.108026 1.415548
H  -5.932587 -1.530688 1.543226
H  5.929789 -1.513619 -1.554236
