program: Gaussian 09
title: 000254510
version: EM64L-G09RevD.01
frameworkgroup: C1[X(C11H13NO4)]
method: RPBEPBE
basis: SDD
operation: Freq
keyword: #p
keyword: freq=noraman
keyword: PBEPBE/SDD
title: #p freq=noraman PBEPBE/SDD
converged: NO YES NO NO
title: Mulliken charges:
elementType: O O O O N C C C C C C C C C C C H H H H H H H H H H H H H
charge: -0.227894 -0.227894 -0.252543 -0.252543 0.088198 -0.054415 -0.054415 -0.260628 -0.260628 -0.174914 0.188562 0.188562 -0.226751 -0.226751 -0.668075 -0.668075 0.282037 0.282037 0.250845 0.230355 0.230357 0.230351 0.230361 0.234327 0.234326 0.208277 0.208278 0.234325 0.234328
chargesum: 0.00000
title: Mulliken charges with hydrogens summed into heavy atoms:
elementType: O O O O N C C C C C C C C C C C
charge: -0.227894 -0.227894 -0.252543 -0.252543 0.088198 -0.054415 -0.054415 0.021409 0.021409 0.075931 0.188562 0.188562 0.233961 0.233961 0.008856 0.008855
polarizability: 1.80146481e+02 7.74634031e-05 1.73670900e+02 -4.87190672e-03 -3.63854744e-03 7.43439061e+01
1716.lowfreq: -5.2331 -0.0003 0.0006 0.0008 2.1883 3.2829 17.3322 32.6397 54.1507
frequency: 17.3282 32.6265 54.1507 61.1104 64.0985 88.6984 101.1187 106.5689 178.3290 179.3132 205.9946 241.8898 247.2762 276.2724 310.7310 314.6307 350.3482 381.6517 427.0602 442.2697 479.6405 538.2821 633.4561 667.2453 705.0984 746.8222 760.5632 786.6177 797.9602 798.2646 813.3271 830.6533 851.8083 898.4254 959.4023 966.2318 1017.4679 1018.5046 1019.7094 1068.7504 1104.2060 1107.9197 1113.3184 1114.1460 1133.9950 1134.0892 1164.1328 1237.1861 1249.2151 1249.3538 1291.0452 1333.8220 1355.7297 1356.3851 1387.2061 1400.5518 1402.6344 1434.8750 1460.2042 1460.4909 1470.8012 1471.6787 1484.4585 1485.8101 1564.7310 1565.1673 1595.1106 1599.2705 2997.9401 2998.0503 3008.5471 3008.6330 3067.9286 3067.9672 3094.6784 3094.9897 3110.9576 3111.0920 3152.8003 3173.1773 3182.8193
redmass: 3.7413 3.1032 3.8679 3.1843 5.5698 2.5516 2.4963 4.2240 2.4901 2.5832 4.7560 1.4253 1.5875 6.0333 5.8917 3.9250 5.7680 4.4080 3.8814 5.5286 6.2948 6.5881 8.3360 8.4131 8.6506 1.9774 7.2703 6.7133 1.1009 1.1175 3.8152 4.3572 2.0583 6.8046 6.9210 1.3960 2.2101 2.2265 1.3646 2.0137 3.8068 3.7297 2.2606 2.2552 1.4654 1.4651 1.1146 2.8144 1.1344 1.1346 3.8182 7.6821 1.3967 1.6447 3.0566 1.2637 1.3556 2.5334 1.0396 1.0396 1.0636 1.0664 1.0700 1.0656 7.1437 5.5709 11.1446 11.2886 1.0360 1.0360 1.0578 1.0578 1.1068 1.1068 1.0986 1.0985 1.1023 1.1023 1.0887 1.0930 1.1000
irintensity: 0.0000 2.7393 0.0741 0.0000 2.3998 9.8088 0.0000 3.2714 0.7580 0.0000 8.8545 0.0000 2.0078 11.3020 2.4958 0.0231 18.6940 5.8606 2.6183 2.8618 0.0000 0.0783 8.6967 21.3884 18.0124 38.8080 0.0000 0.5742 6.6184 0.0000 6.3902 6.5832 26.8661 3.3952 7.3249 0.0000 20.6960 50.7204 1.2761 189.8765 121.6300 240.7922 6.9389 26.4338 0.0000 12.2812 0.0000 138.8209 0.0000 0.0073 418.5065 0.3576 2.9275 2.9679 27.0981 1.6797 24.7903 3.0171 0.0000 24.0365 0.9934 8.1096 29.1000 0.5274 11.6491 11.5646 200.7270 112.3648 0.0053 38.7265 39.4941 0.3356 0.0482 20.6958 57.7050 2.8545 0.0000 78.5553 6.3774 0.2708 5.9467
temp: 298.150 k
press: 1.00000 atm
elementType: 8 8 8 8 7 6 6 6 6 6 6 6 6 6 6 6 1 1 1 1 1 1 1 1 1 1 1 1 1
symmnumber: 1
zpe: 587586.6 jmol-1
zpe.correction: 0.223800 hartree
zpe.thermalcorrener: 0.240335 hartree
zpe.thermalcorrenthalpy: 0.241279 hartree
zpe.thermalcorrgfe: 0.176788 hartree
zpe.sumelectzpe: -781.424050 hartree
zpe.sumelectthermal: -781.407515 hartree
zpe.sumelectthermalent: -781.406571 hartree
zpe.sumelectthermalfe: -781.471062 hartree
dipole: 0.0000 1.0731 0.0001
dipole: 1.0731
quadrupole: -95.5821 -75.0985 -92.4906
quadrupole: 0.0000 0.0014 0.0011
quadrupole: -7.8583 12.6252 -4.7669 0.0000 0.0014 0.0011
hfenergy: -781.64785 hartree
pointgroup: C01 [X(C11H13N1O4)]
dipole: 0.0000478 -0.4221755 -0.0000146 debye
polarizability: 180.1464665|0.000819|173.6708984|0.0390797|0.0118758|74.3439216 unknown
InChI: InChI=1S/C11H13NO4/c1-3-15-10(13)8-6-5-7-9(12-8)11(14)16-4-2/h5-7H,3-4H2,1-2H3
charge 0 multiplicity 1
29 atoms
O  2.337912 -1.111565 0.000674
O  -2.337572 -1.112102 -0.001013
O  3.592854 0.850513 0.00164
O  -3.592962 0.849689 -0.001065
N  0.000011 0.288072 -0.00007
C  1.163943 0.997657 0.000609
C  -1.164086 0.997389 -0.000504
C  1.214056 2.416771 0.000887
C  -1.214525 2.416491 -0.000262
C  -0.000317 3.134821 0.000442
C  2.479941 0.261165 0.001121
C  -2.479914 0.260596 -0.001305
C  3.614849 -1.894762 0.001009
C  -3.614331 -1.895588 -0.001068
C  3.218383 -3.366868 0.000488
C  -3.217532 -3.367605 -0.000739
H  2.188931 2.912013 0.001448
H  -2.189514 2.911508 -0.000643
H  -0.000444 4.229094 0.000638
H  4.196589 -1.6082 0.896103
H  4.197323 -1.607766 -0.893469
H  -4.196363 -1.609102 -0.895998
H  -4.196646 -1.608782 0.893574
H  2.620825 -3.61171 -0.893815
H  2.620059 -3.612134 0.894162
H  4.125548 -3.998403 0.000727
H  -4.124553 -3.999346 -0.000749
H  -2.619409 -3.61269 -0.894598
H  -2.619661 -3.612355 0.893379
