program: Gaussian 09
title: 000254507
version: EM64L-G09RevD.01
frameworkgroup: C1[X(C10H11ClO2)]
method: RPBEPBE
basis: SDD
operation: Freq
keyword: #p
keyword: freq=noraman
keyword: PBEPBE/SDD
title: #p freq=noraman PBEPBE/SDD
converged: YES YES NO NO
title: Mulliken charges:
elementType: Cl O O C C C C C C C C C C H H H H H H H H H H H
charge: -0.071273 -0.295133 -0.268863 -0.054239 -0.349814 -0.311250 0.221431 0.341007 -0.332702 -0.369768 -0.782969 -0.238525 -0.102279 0.250465 0.223029 0.229325 0.226283 0.217938 0.253235 0.261070 0.218815 0.239918 0.240097 0.254202
chargesum: 0.00000
title: Mulliken charges with hydrogens summed into heavy atoms:
elementType: Cl O O C C C C C C C C C C
charge: -0.071273 -0.295133 -0.268863 0.196226 0.102540 0.132971 0.221431 0.341007 -0.079466 -0.108698 -0.084139 0.015677 -0.102279
polarizability: 1.80885649e+02 -6.16515184e+00 1.18796728e+02 -3.84389484e-01 1.25998592e+00 6.95475581e+01
1716.lowfreq: -10.3337 -4.8504 -0.0019 -0.0016 0.0007 7.2391 34.2203 50.0714 85.5574
frequency: 34.1875 50.0496 85.5536 101.7997 114.0966 144.3571 193.6860 205.1256 237.5647 240.7404 333.3175 366.8185 397.1107 425.0269 443.1000 494.5523 547.4991 548.6151 636.0400 712.4456 730.0030 776.0593 798.9833 802.5580 855.5507 876.1298 898.1584 923.5227 965.0371 984.2918 993.8192 1028.9295 1046.5360 1087.0293 1097.7796 1113.7186 1125.1616 1140.1056 1186.4149 1210.7968 1236.3549 1237.9830 1268.2312 1348.5355 1377.0527 1394.0447 1401.6929 1414.6387 1457.2922 1467.2133 1473.7599 1479.4517 1487.3036 1589.8818 1600.5662 2966.6710 2985.0996 3030.1120 3063.0298 3072.1393 3096.3861 3115.4308 3156.7985 3157.6073 3177.0418 3182.2575
redmass: 5.8480 3.6196 5.2608 3.4953 1.1152 4.8009 3.0974 4.9331 3.5211 8.1711 6.1514 4.8320 3.1782 3.8298 2.8986 4.1412 3.5738 4.5121 8.4055 3.3875 6.5610 6.2901 2.5624 1.8872 6.2072 1.3438 1.1916 1.3506 2.6693 2.6656 1.5651 1.4282 1.5193 1.8953 1.3671 1.3372 1.9864 1.5479 2.1508 1.3437 2.8721 1.5335 1.2985 1.3991 5.3148 3.0702 1.2891 1.9580 1.0452 1.5688 1.1884 1.4097 1.3267 7.1624 6.9282 1.0556 1.0366 1.1070 1.0968 1.0532 1.1003 1.0920 1.0894 1.0911 1.0970 1.1192
irintensity: 0.2869 2.3706 2.6599 1.8547 0.0396 7.1356 3.2061 2.9364 11.3286 0.4227 0.1514 0.6872 6.0433 7.9822 4.8323 4.7247 5.7636 1.7481 24.8936 0.4376 2.8565 13.4499 44.5954 46.3535 34.7545 17.5616 6.0214 0.2801 14.4723 56.0470 12.7776 0.3049 7.4888 5.1028 5.1871 14.5572 117.8261 4.1941 114.7005 13.2388 88.8926 23.5295 4.6494 10.7234 13.0794 15.9393 16.6732 7.4905 14.1959 66.1511 11.1440 91.2897 33.4633 0.5162 11.3198 32.4831 23.1045 26.3836 15.9677 22.8374 20.4153 15.1950 9.7767 1.6854 4.4990 28.1196
temp: 298.150 k
press: 1.00000 atm
elementType: 17 8 8 6 6 6 6 6 6 6 6 6 6 1 1 1 1 1 1 1 1 1 1 1
symmnumber: 1
zpe: 485617.1 jmol-1
zpe.correction: 0.184962 hartree
zpe.thermalcorrener: 0.197950 hartree
zpe.thermalcorrenthalpy: 0.198894 hartree
zpe.thermalcorrgfe: 0.144012 hartree
zpe.sumelectzpe: -997.142621 hartree
zpe.sumelectthermal: -997.129633 hartree
zpe.sumelectthermalent: -997.128689 hartree
zpe.sumelectthermalfe: -997.183570 hartree
dipole: -1.7709 1.3233 0.4018
dipole: 2.2469
quadrupole: -99.0027 -77.8068 -83.3672
quadrupole: -5.8243 -3.3670 -0.0616
quadrupole: -12.2771 8.9188 3.3583 -5.8243 -3.3670 -0.0616
hfenergy: -997.3275828 hartree
pointgroup: C01 [X(C10H11Cl1O2)]
dipole: -0.7098978 -0.526542 -0.0158479 debye
dipolederiv: -0.874004 -0.0892272 0.0875615 -0.0793105 -0.1453679 0.0219996 0.0926467 0.0233044 -0.0895836 -0.5850456 0.1231902 0.0543773 0.1670383 -0.5412989 -0.0078351 0.075991 -0.0140547 -0.2914564 -1.9571384 0.1931938 0.0505869 0.1505722 -0.3298522 0.0052488 0.132894 -0.0105444 -0.2683325 0.3465563 0.0362502 -0.0305875 0.0066263 0.2052303 -0.0957081 -0.1349917 -0.0149523 0.2518812 0.1621989 -0.0011599 -0.1306062 0.076022 0.2476455 0.0503801 -0.0392028 -0.0319937 0.1979162 0.8608059 -0.1821772 0.0747665 -0.5970062 0.3976921 0.0703313 0.0650372 0.0384723 0.3088593 1.567984 -0.0330937 -0.0957638 0.2015017 -0.1024067 0.0266482 -0.1751237 0.0409661 0.0642509 -0.2184512 0.091461 -0.0161619 0.2368094 0.2693859 -0.0908766 -0.0330639 -0.0788141 -0.0207629 -0.2166316 0.0794023 -0.0216037 -0.2187574 -0.0091377 -0.0279417 0.0485089 -0.0507589 -0.1821342 -0.1901818 -0.0977823 0.0276364 -0.0106296 -0.0311687 -0.0169252 0.0092774 -0.0113733 -0.1260252 -0.0152879 -0.1524195 0.0394733 -0.1027276 -0.0418013 0.0312359 0.0290732 0.0368417 0.0465783 -0.2176375 -0.1057518 0.0321815 0.0150528 0.0061746 -0.0264869 0.0070592 -0.0156861 -0.1147316 1.1631118 0.1604977 -0.1464571 0.0639671 0.0373062 -0.0315126 -0.1312445 -0.0397861 -0.0545613 0.0062329 -0.0122719 -0.0060028 -0.0430082 0.0648378 0.0707056 0.0036776 0.0834317 -0.0743903 0.0916662 -0.0169696 0.099342 -0.0411987 0.0455407 -0.0088412 0.0704127 -0.0390069 -0.0935022 -0.0254059 -0.1118585 0.0280239 -0.1270539 -0.030447 -0.0289856 0.0210483 0.0023384 0.0630657 -0.0458452 -0.0523183 -0.0677741 0.083846 -0.0731835 -0.0870031 -0.0331886 -0.1022851 -0.0207887 -0.0033192 0.0023109 0.0216291 0.1027076 0.0014652 0.0424486 -0.0186218 0.0886916 -0.1084698 0.0056315 0.0929614 -0.004343 0.1065643 0.0008077 0.0301014 -0.0093494 0.0282736 0.1580064 0.044114 0.0670458 -0.0052059 0.0747335 -0.0000154 0.0282469 -0.0059646 0.0281953 0.1532037 -0.0443987 0.1685934 -0.0236094 0.066605 -0.0352331 0.0259882 0.000212 0.0150629 0.1059613 0.0600185 -0.0270469 0.1080699 -0.0173816 0.0466978 -0.0213868 0.1029504 0.0373254 -0.0596739 0.0209135 -0.0818791 -0.0955076 -0.0612268 0.0280189 -0.0036283 -0.0996443 -0.0573042 -0.0016962 0.0641136 -0.0509508 0.0199748 -0.053746 -0.0108903 0.0437965 0.0216066 0.0436562 0.1563858 unknown
polarizability: 180.9471903|4.3127344|116.6555445|-4.6676965|-9.6695561|71.6272006 unknown
InChI: InChI=1S/C10H11ClO2/c1-7-4-8(11)2-3-10(7)13-6-9-5-12-9/h2-4,9H,5-6H2,1H3
charge 0 multiplicity 1
24 atoms
Cl 4.841814 0.462135 -0.435253
O  -4.518341 1.183922 -0.013317
O  -1.090748 -0.318986 0.289457
C  -3.403728 0.272358 0.441637
C  -4.303334 -0.163261 -0.670934
C  -2.020474 0.815101 0.158897
C  0.281114 -0.057533 0.106668
C  1.13391 -1.189347 0.276233
C  0.805877 1.214243 -0.221597
C  2.52348 -1.005211 0.104903
C  0.547825 -2.540204 0.62781
C  2.200837 1.380933 -0.38875
C  3.037196 0.266713 -0.222317
H  -3.551599 -0.158409 1.439653
H  -3.93742 -0.115759 -1.704058
H  -5.087645 -0.902084 -0.4705
H  -1.757605 1.60678 0.889706
H  -1.977881 1.242199 -0.863056
H  0.153486 2.081832 -0.353668
H  3.201106 -1.855501 0.228504
H  1.337439 -3.304695 0.718056
H  -0.009658 -2.494559 1.581343
H  -0.176669 -2.869877 -0.139248
H  2.616217 2.360107 -0.64257
