program: Gaussian 09
title: 000254506
version: EM64L-G09RevD.01
frameworkgroup: C1[X(C10H7Cl5O3)]
method: RPBEPBE
basis: SDD
operation: Freq
keyword: #p
keyword: freq=noraman
keyword: PBEPBE/SDD
title: #p freq=noraman PBEPBE/SDD
converged: YES YES NO NO
title: Mulliken charges:
elementType: Cl Cl Cl Cl Cl O O O C C C C C C C C C C H H H H H H H
charge: -0.012224 0.116735 0.102811 0.126169 -0.047808 -0.230187 -0.247909 -0.187032 0.523523 -0.430647 -0.193525 0.274241 -0.296582 -0.298338 -0.565520 -0.193971 -0.229266 -0.110266 0.288081 0.252122 0.283214 0.288856 0.245987 0.282628 0.258908
chargesum: 0.00000
title: Mulliken charges with hydrogens summed into heavy atoms:
elementType: Cl Cl Cl Cl Cl O O O C C C C C C C C C C
charge: -0.012224 0.116735 0.102811 0.126169 -0.047808 -0.230187 -0.247909 -0.187032 0.523523 0.109556 0.378545 0.274241 -0.296582 -0.052351 -0.565520 0.088657 0.029642 -0.110266
polarizability: 2.14061464e+02 1.51898786e+01 1.76875158e+02 -1.01941097e+01 -3.09544839e+00 1.07925503e+02
1716.lowfreq: -6.1208 -2.2157 -0.0027 -0.0024 -0.0019 2.9764 12.3673 19.2500 24.5154
frequency: 12.0212 19.1265 24.5017 47.3050 48.6094 75.5604 103.6305 143.6148 164.7749 171.5478 180.1696 192.4875 207.7030 231.8413 256.9564 264.4801 310.2181 337.3071 355.3258 360.1234 363.5626 387.7732 438.5606 447.9492 509.0558 540.1930 548.9313 569.9232 618.8371 631.5985 663.9294 681.9593 701.4663 740.6756 794.1645 797.8004 837.2028 863.9875 924.2847 948.3144 1001.2925 1015.8767 1043.2558 1053.7195 1078.7680 1086.3514 1088.1522 1154.4123 1218.4192 1244.3076 1252.0610 1260.2238 1341.9650 1359.1669 1364.6218 1387.3045 1440.8270 1445.7870 1462.5701 1574.5288 1595.2179 1691.8345 2999.0271 3030.8273 3089.9864 3113.0989 3155.1233 3180.4436 3183.9435
redmass: 15.1666 20.2116 10.3208 13.7624 12.2378 11.4927 8.2760 15.4927 5.9420 16.3513 13.9656 6.3791 10.2968 8.5000 6.7627 17.9449 7.7929 6.6672 8.9226 4.4895 5.7938 9.7101 3.2863 5.6675 4.6323 4.1292 4.1035 5.3407 7.7481 5.1618 7.0192 6.9970 3.6720 10.9810 2.0449 3.1404 6.2062 1.3932 1.3508 8.5341 2.1992 5.8133 5.0758 2.1382 5.7980 2.3871 4.3442 1.3016 1.7072 1.4760 1.0933 1.5712 1.2984 1.3291 4.6673 5.3895 1.0793 1.0843 2.6327 7.5974 7.9081 10.3187 1.0645 1.0577 1.0967 1.1070 1.0886 1.0959 1.0938
irintensity: 0.2651 0.2070 0.2690 0.4547 0.4799 1.6391 0.6099 0.6317 0.1564 0.6930 2.4733 4.4520 0.4398 0.9271 3.1236 1.1351 5.9453 4.6799 1.2915 21.7848 1.1784 1.8675 9.9620 7.0103 18.6148 18.0167 7.0992 3.6546 43.6617 67.5629 110.8531 40.8363 0.8664 107.4869 43.5857 40.0865 51.9844 21.3803 0.2945 26.7555 15.0092 11.9597 463.1059 18.3999 62.4457 158.6137 59.9134 6.3105 45.2211 19.9048 23.7263 91.3752 3.8991 23.3953 25.1820 2.1038 21.7105 27.9938 229.2581 26.0808 3.0992 151.5181 24.7508 20.4693 4.2007 1.1556 6.6063 0.8255 1.2360
temp: 298.150 k
press: 1.00000 atm
elementType: 17 17 17 17 17 8 8 8 6 6 6 6 6 6 6 6 6 6 1 1 1 1 1 1 1
symmnumber: 1
zpe: 397343.1 jmol-1
zpe.correction: 0.151340 hartree
zpe.thermalcorrener: 0.170079 hartree
zpe.thermalcorrenthalpy: 0.171024 hartree
zpe.thermalcorrgfe: 0.099241 hartree
zpe.sumelectzpe: -2909.869408 hartree
zpe.sumelectthermal: -2909.850669 hartree
zpe.sumelectthermalent: -2909.849724 hartree
zpe.sumelectthermalfe: -2909.921507 hartree
dipole: -3.2946 -1.0656 1.3593
dipole: 3.7199
quadrupole: -143.6815 -139.6524 -140.3913
quadrupole: 6.6382 3.8600 -1.0756
quadrupole: -2.4398 1.5893 0.8505 6.6382 3.8600 -1.0756
hfenergy: -2910.020748 hartree
pointgroup: C01 [X(C10H7Cl5O3)]
dipole: 1.3089323 0.2079613 -0.6207562 debye
dipolederiv: -0.1261854 -0.1662193 -0.0810783 -0.1414626 -0.536038 -0.2816505 -0.0586941 -0.2709425 -0.1905045 -0.5790969 0.0430772 -0.3244458 -0.0103936 -0.1633028 0.0392732 -0.3983132 0.0559877 -0.4413207 -0.6387368 0.1841428 0.175564 0.2221829 -0.247711 -0.1009277 0.1902121 -0.0665124 -0.217931 -0.2359397 -0.0921241 0.1830346 -0.1395003 -0.2816486 0.2466599 0.1834525 0.2301141 -0.5393487 -0.4906984 0.233937 0.2731637 0.2442294 -0.2798142 -0.2104033 0.2977853 -0.2161724 -0.2829023 -1.4447355 0.2659923 0.3724317 0.4507852 -0.3328367 -0.182881 0.6566557 -0.1599105 -0.5220757 -1.7405439 -0.456078 -0.1441898 -0.4494718 -0.4587179 -0.0455095 -0.2459223 -0.0242575 -0.4412656 -0.7676931 -0.1081724 -0.053041 -0.2081898 -0.4258604 0.1442693 0.2292137 0.3269634 -0.599201 0.8822796 -0.3842815 -0.3984665 -0.810955 0.0720047 0.1444422 -0.7164658 0.0781339 0.3495897 0.9508084 -0.0758059 -0.2039467 0.2130713 0.2045171 -0.0544207 -0.2523298 0.0426857 0.0713468 0.4413972 0.1745241 0.1699771 0.0229172 0.1067727 0.1300865 0.5229167 0.245323 0.1397337 1.8873633 0.4852802 0.1196661 0.5611579 0.5248195 -0.1788856 -0.2446836 -0.4691897 0.7375385 -0.0009569 0.3563082 0.1796583 0.2750447 0.7806033 0.4870614 0.1485325 0.4331125 0.1517852 -0.0465417 -0.0543475 -0.0360287 0.2665678 -0.0718747 0.0058654 0.1521526 0.094525 -0.1439689 1.4347662 -0.1311521 -0.0566421 -0.0627681 0.7248228 -0.2415248 -0.0792963 -0.2319105 1.2790377 -0.149103 0.0416482 0.0523954 0.0446597 -0.2206682 -0.1328866 0.0578978 -0.1210205 -0.1508397 -0.0994602 0.1674176 0.0943627 0.049122 -0.077841 -0.0085607 0.0122998 -0.0359803 -0.1288563 0.6092762 -0.3746351 -0.4507996 -0.3581901 0.2896291 0.3499319 -0.4551352 0.3614989 0.2857608 -0.0180347 0.0284016 0.0375644 0.0462925 0.0879997 -0.068047 0.0523671 -0.0383021 0.0625453 -0.0256622 0.0145591 -0.0030663 -0.0958672 -0.0539634 0.0873139 -0.0283243 0.001295 0.1134915 -0.0566189 0.000965 -0.0090923 0.0346598 0.0651148 -0.0428542 -0.016005 -0.0698463 0.0690721 0.1272217 -0.0340089 0.0416374 -0.0097661 0.0762742 0.0495656 -0.093015 -0.0252246 0.0256584 -0.0501085 -0.0451392 0.0438549 -0.075343 0.0843907 -0.0335541 0.0550044 -0.0349231 0.1127283 0.0341057 -0.0392328 0.0178633 -0.0373519 0.1095134 -0.0246111 0.0211144 -0.023375 0.1480361 0.1028978 -0.0350564 -0.0003766 -0.0314309 0.0238147 -0.0777525 0.0085798 -0.0820717 0.1118902 unknown
polarizability: 215.9965206|3.5832465|146.382917|-18.9744483|31.5261498|136.4826871 unknown
InChI: InChI=1S/C10H7Cl5O3/c11-6-1-2-8(7(12)3-6)17-4-9(16)18-5-10(13,14)15/h1-3H,4-5H2
charge 0 multiplicity 1
25 atoms
Cl -3.726357 -2.480188 -1.384982
Cl 5.216918 0.960791 1.854689
Cl 2.405203 1.970438 1.288339
Cl 4.512911 2.029217 -0.889925
Cl -5.166354 1.817912 1.821996
O  -1.081515 -1.178665 -1.461072
O  2.44731 -0.331599 -0.854841
O  0.927492 -1.387828 0.595063
C  -1.963286 -0.429406 -0.668017
C  0.25153 -0.661413 -1.693638
C  3.494939 -0.355449 0.176343
C  1.183549 -0.858053 -0.495527
C  -3.283131 -0.936644 -0.549297
C  -1.636399 0.779134 -0.007033
C  3.872478 1.079192 0.568372
C  -4.261298 -0.265136 0.204189
C  -2.607993 1.468633 0.751884
C  -3.906026 0.938235 0.845793
H  0.646018 -1.242969 -2.543124
H  0.248689 0.407383 -1.984037
H  4.375248 -0.852685 -0.262058
H  3.138222 -0.902642 1.06778
H  -0.624112 1.19112 -0.054087
H  -5.271897 -0.672744 0.28352
H  -2.348339 2.39867 1.264272
