program: Gaussian 09
title: 000254503
version: EM64L-G09RevD.01
frameworkgroup: C1[X(C13H10ClNO)]
method: RPBEPBE
basis: SDD
operation: Freq
keyword: #p
keyword: freq=noraman
keyword: PBEPBE/SDD
title: #p freq=noraman PBEPBE/SDD
converged: NO YES NO NO
title: Mulliken charges:
elementType: Cl O N C C C C C C C C C C C C C H H H H H H H H H H
charge: -0.049960 -0.251491 -0.151562 -0.252456 0.528583 0.288321 -0.402999 -0.334734 -0.323514 -0.370854 -0.209568 -0.211168 -0.211075 -0.200406 -0.101924 -0.243756 0.242939 0.239777 0.278786 0.273433 0.252796 0.258876 0.258774 0.229649 0.231913 0.231620
chargesum: 0.00000
title: Mulliken charges with hydrogens summed into heavy atoms:
elementType: Cl O N C C C C C C C C C C C C C
charge: -0.049960 -0.251491 -0.151562 -0.009518 0.528583 0.288321 -0.163222 -0.055948 -0.050081 -0.118058 0.049309 0.047606 0.018574 0.031507 -0.101924 -0.012136
polarizability: 2.67416565e+02 -5.54845925e+00 1.15526534e+02 8.52067826e+00 -6.13003647e+00 1.10702637e+02
1716.lowfreq: -5.8368 -4.2365 -0.0020 -0.0018 -0.0017 0.7859 15.0261 36.4459 38.4714
frequency: 14.1685 36.4343 38.4640 76.6114 131.6437 148.3201 213.6908 252.5303 272.1502 347.4630 372.3894 388.7129 404.5833 410.3357 449.3460 505.8782 526.9683 595.0789 608.9066 621.7050 660.5336 685.3951 697.3699 719.8546 746.6145 768.5799 813.7457 828.5343 832.3406 839.7577 848.5997 923.7050 951.8402 967.3867 977.0033 985.5545 995.0522 1001.3853 1019.6338 1068.8412 1072.5245 1088.4674 1090.8418 1114.5453 1167.3726 1170.9496 1181.8132 1203.5556 1241.4264 1293.6365 1305.7834 1346.0378 1382.8017 1390.7233 1414.0236 1437.2346 1465.1866 1481.2085 1588.0421 1591.4035 1600.7801 1604.7035 3061.5688 3130.2925 3131.2199 3139.6486 3153.6464 3160.6841 3164.7621 3172.8387 3174.5460 3179.7250
redmass: 4.2398 4.7519 7.5513 6.5575 8.0058 5.7315 6.4354 7.0390 5.8573 6.3473 5.1446 7.0272 2.9938 2.9417 7.5815 3.4878 3.2811 6.7855 6.4819 7.1170 6.5320 6.0765 2.3504 4.2778 3.1445 2.0582 6.6551 1.3126 3.8097 1.6090 1.2546 1.4309 1.3494 1.3699 1.3635 6.1341 1.3090 4.1934 2.1415 2.8845 1.6612 2.3906 1.3051 1.5103 1.3004 1.0720 1.1165 2.9497 1.9390 1.3183 1.3374 2.5056 9.4074 5.4843 2.0235 2.2556 2.1927 2.6334 7.3227 6.5590 6.0632 6.1176 1.0887 1.0849 1.0903 1.0888 1.0932 1.0886 1.0960 1.1000 1.0953 1.0975
irintensity: 0.7265 0.2779 0.0605 2.8283 4.2632 0.1931 2.4555 0.6391 2.9700 3.6805 0.4183 2.5688 1.7517 0.3672 37.8215 22.6383 16.8315 11.2907 0.1194 0.1562 2.3753 16.8632 28.0758 5.2782 61.7367 63.1564 7.0430 4.4598 39.1089 40.8490 0.1919 4.5382 0.0381 0.0775 0.1711 0.4750 0.5610 41.0947 12.3864 32.9081 22.7781 9.2317 7.3312 5.6874 2.6165 0.7783 6.3757 22.8203 34.2790 13.9513 0.3015 49.4186 0.0651 9.7395 24.1830 8.6080 42.9505 53.0941 3.3503 6.9655 42.1625 23.3505 18.8845 0.8648 8.9186 10.4110 19.5216 0.7859 12.8649 17.5897 3.9467 0.8552
temp: 298.150 k
press: 1.00000 atm
elementType: 17 8 7 6 6 6 6 6 6 6 6 6 6 6 6 6 1 1 1 1 1 1 1 1 1 1
symmnumber: 1
zpe: 505117.8 jmol-1
zpe.correction: 0.192389 hartree
zpe.thermalcorrener: 0.205844 hartree
zpe.thermalcorrenthalpy: 0.206788 hartree
zpe.thermalcorrgfe: 0.149221 hartree
zpe.sumelectzpe: -1090.218166 hartree
zpe.sumelectthermal: -1090.204712 hartree
zpe.sumelectthermalent: -1090.203768 hartree
zpe.sumelectthermalfe: -1090.261335 hartree
dipole: 1.8563 0.7728 2.3045
dipole: 3.0584
quadrupole: -97.5866 -98.9210 -95.9755
quadrupole: 2.5449 3.9822 -4.0520
quadrupole: -0.0922 -1.4266 1.5188 2.5449 3.9822 -4.0520
hfenergy: -1090.4105556 hartree
pointgroup: C01 [X(C13H10Cl1N1O1)]
dipole: 0.7151677 0.2247008 -0.941219 debye
dipolederiv: -0.9443145 -0.1720956 -0.0531573 -0.2075387 -0.1311265 0.0148775 -0.0686505 0.0140326 -0.1064471 -0.7111441 -0.0330937 0.0154099 -0.0203471 -0.3465997 -0.2465602 -0.0985224 -0.1289922 -0.4073106 -0.664057 0.0357297 0.0370836 -0.103415 -0.0516902 0.1114479 -0.0945005 0.0582343 0.0642833 1.1665238 0.1152371 0.0317896 0.2414678 0.3031167 0.0444793 0.2238769 -0.0432329 0.2872427 -0.1728972 -0.0728544 0.0084029 0.0237048 -0.0781167 0.0064023 0.0302453 0.0364446 -0.0894282 0.8039172 -0.1129098 -0.1571831 -0.0386658 0.0207771 0.0249691 -0.2261406 0.0261182 -0.0008872 0.0596673 0.103983 -0.0274773 -0.0508538 -0.0410952 -0.111571 0.1259322 -0.0823892 -0.0062427 0.0849505 -0.0014864 0.0795096 0.0819352 -0.0390034 -0.0482318 -0.0096118 -0.0771544 -0.0104068 -0.3214083 0.0141043 0.0032325 -0.0113179 -0.064805 0.0513999 -0.0907963 0.067833 -0.0679083 -0.2612052 0.107185 0.0123614 0.0642697 0.0011646 0.0327901 0.1362811 0.0174416 -0.1493258 -0.3697271 -0.1211545 0.0754404 -0.163857 -0.1240677 -0.028407 0.0875392 -0.0221328 -0.0391837 -0.4191576 0.0147769 -0.1052956 0.0055545 -0.0472078 -0.0692391 -0.1492733 -0.0664131 -0.0538269 0.0441844 0.0890438 -0.025631 0.1316774 0.0638427 0.0781973 -0.0113206 0.083991 -0.0852182 0.048454 -0.01342 -0.0687304 -0.0086842 0.0568907 0.1042454 -0.0824635 0.1098322 -0.0578652 1.3185332 0.2882428 0.104305 0.3145896 0.0963963 -0.0873919 0.1238503 -0.0888368 0.0862547 -0.0174359 0.0166245 -0.0805855 -0.0221016 -0.1210983 0.0274726 -0.0689027 0.0212709 -0.1269814 -0.0280585 -0.0398195 0.0090763 -0.0240953 0.0162274 0.0805398 0.0227701 0.0804938 -0.0392726 0.0479116 -0.081549 0.052441 -0.063733 0.0514001 0.0978855 0.0460757 0.0915759 0.0461464 0.0996 0.0199083 -0.0693014 0.0393408 0.1070841 0.0434916 -0.0641187 0.0524374 0.0706593 0.1598375 0.0376537 0.0511031 0.0239832 0.0431771 -0.05904 0.0399687 -0.072937 0.1042701 0.0584328 -0.102843 0.0032538 -0.0979632 0.023974 -0.0330744 -0.0032198 -0.0268252 0.1362221 0.0326084 0.0232518 -0.0711977 0.0193991 0.1179909 0.0673945 -0.0717006 0.0690586 0.0547049 0.0561184 -0.0524536 0.033403 -0.057656 0.0799105 0.0835512 0.0312767 0.0817546 0.0688072 -0.0147722 -0.1009262 -0.0013268 -0.1281551 -0.0137718 -0.0495232 0.0054162 -0.0598266 0.1227412 0.048075 0.0442329 0.0533563 0.060163 -0.0286329 -0.1083022 0.0678153 -0.1110365 0.0824568 -0.1046366 -0.0053684 0.0897178 -0.0077016 0.1052629 -0.0278031 0.0981736 -0.0307424 0.116516 unknown
polarizability: 266.5138143|14.2467716|120.4654304|-5.7995547|-1.1221169|106.6664914 unknown
InChI: InChI=1S/C13H10ClNO/c14-11-8-6-10(7-9-11)13-15(16-13)12-4-2-1-3-5-12/h1-9,13H
charge 0 multiplicity 1
26 atoms
Cl -5.953708 -0.749817 -0.264156
O  0.533667 1.003818 1.521003
N  0.92396 -0.292352 0.709246
C  -0.035364 0.722653 0.169012
C  -1.471154 0.356213 0.063948
C  2.291418 -0.204494 0.201154
C  -2.273604 0.927546 -0.953814
C  -2.048975 -0.555361 0.984914
C  3.153146 0.890198 0.445616
C  2.741953 -1.336041 -0.522325
C  -3.642051 0.595606 -1.062675
C  -3.41313 -0.895299 0.889815
C  4.470218 0.857225 -0.063767
C  4.055346 -1.349056 -1.039012
C  -4.18738 -0.312994 -0.13576
C  4.923306 -0.254052 -0.812189
H  0.360719 1.394708 -0.609669
H  -1.835849 1.636091 -1.66724
H  -1.419697 -0.990091 1.767358
H  2.791821 1.731298 1.045137
H  2.067975 -2.187047 -0.665279
H  -4.267255 1.032817 -1.845973
H  -3.868733 -1.596506 1.594575
H  5.1452 1.698292 0.130068
H  4.404166 -2.219064 -1.606056
H  5.945905 -0.273391 -1.20413
