program: Gaussian 09
title: 000254501
version: EM64L-G09RevD.01
frameworkgroup: C1[X(C14H13NO2)]
method: RPBEPBE
basis: SDD
operation: Freq
keyword: #p
keyword: freq=noraman
keyword: PBEPBE/SDD
title: #p freq=noraman PBEPBE/SDD
converged: YES YES NO NO
title: Mulliken charges:
elementType: O O N C C C C C C C C C C C C C C H H H H H H H H H H H H H
charge: -0.256751 -0.261777 -0.153896 -0.261664 0.520410 0.295286 -0.395035 -0.353787 -0.331221 -0.374341 -0.354494 -0.348078 0.325784 -0.210597 -0.201106 -0.246444 -0.538087 0.239304 0.234340 0.269797 0.273498 0.250693 0.253244 0.243002 0.227634 0.229313 0.229523 0.224776 0.223647 0.247026
chargesum: 0.00000
title: Mulliken charges with hydrogens summed into heavy atoms:
elementType: O O N C C C C C C C C C C C C C C
charge: -0.256751 -0.261777 -0.153896 -0.022360 0.520410 0.295286 -0.160694 -0.083990 -0.057723 -0.123648 -0.101250 -0.105076 0.325784 0.017037 0.028207 -0.016922 0.157362
polarizability: 2.78773546e+02 -8.11292216e+00 1.26602533e+02 7.79464271e+00 -3.08382492e+00 1.16110429e+02
1716.lowfreq: -2.6948 -0.0008 -0.0005 -0.0003 3.1137 10.9381 23.4330 33.0498 40.6068
frequency: 23.2232 33.0302 40.5953 76.5727 103.3912 129.4736 169.9101 221.3488 236.8839 248.2089 280.2367 339.2002 393.4170 396.3461 405.9297 417.4646 472.3627 514.1049 518.6499 551.4222 600.2486 609.5663 626.6819 681.5283 698.5712 725.2558 742.1037 752.4608 774.4759 809.5006 818.0290 838.0967 840.3401 848.0512 921.7412 948.0259 961.7992 976.1546 985.1045 985.5262 993.5601 1002.7714 1020.1475 1071.3666 1085.9261 1088.3927 1112.2604 1117.3442 1156.6730 1167.7853 1170.1070 1177.2879 1204.0590 1231.7519 1247.3573 1304.9553 1306.5080 1348.5274 1383.0678 1404.1924 1429.3407 1436.7962 1437.3090 1465.3207 1468.8690 1474.3036 1508.8056 1584.8793 1591.1595 1601.5039 1624.9692 2964.2517 3054.1245 3059.1924 3125.5884 3128.2552 3128.4423 3137.7977 3151.4923 3152.3045 3164.5536 3169.4703 3172.5267 3173.3783
redmass: 4.1192 4.2034 5.1526 5.0408 3.8723 5.0525 4.3519 4.7745 1.4084 3.3473 3.1559 5.0927 6.6345 5.1149 3.0747 3.1743 4.2741 3.9618 3.0482 3.9662 6.3996 6.4808 7.0550 6.3013 2.1784 5.5693 3.4233 3.1312 2.6052 5.7796 1.3112 1.6974 4.2661 1.2708 1.4367 1.3608 1.3602 1.3620 6.7743 7.6040 1.3066 2.7159 2.1505 1.6589 2.0075 1.5208 1.2596 1.4443 1.3323 1.2375 1.0955 1.2225 2.9746 2.5075 2.2321 1.3689 1.3574 2.4835 9.3522 3.2526 2.7759 2.2432 1.1885 2.1965 1.0501 1.0733 2.6792 7.0208 6.5884 6.0694 6.3029 1.0327 1.1041 1.0886 1.0899 1.0849 1.0996 1.0888 1.0876 1.0934 1.0970 1.0952 1.0963 1.0984
irintensity: 0.5964 2.5536 0.1600 1.4319 7.6642 4.9678 1.8250 2.1322 0.1165 0.5978 1.9615 1.3299 4.1801 0.1114 1.4075 0.3359 2.2569 27.2672 12.4210 63.9710 6.4241 0.1734 0.9315 21.5962 35.5961 8.1857 8.7028 49.3531 46.7028 4.2727 4.8733 55.2583 22.3714 0.3226 5.0273 0.0671 0.3538 0.2622 17.8651 32.3659 0.6777 5.1977 13.0754 11.4400 8.7788 10.0255 0.1902 6.7469 4.2853 2.0412 1.4800 129.6306 46.6996 83.2991 156.6237 18.7218 8.8550 115.7338 0.6495 12.6713 21.6234 9.4200 7.5672 49.3066 14.3404 45.5466 70.1757 20.3744 7.6028 35.9693 125.8927 68.5556 45.4153 20.3813 13.1406 2.3715 23.9916 11.5930 7.9542 21.9831 16.9443 9.6565 5.2877 12.9589
temp: 298.150 k
press: 1.00000 atm
elementType: 8 8 7 6 6 6 6 6 6 6 6 6 6 6 6 6 6 1 1 1 1 1 1 1 1 1 1 1 1 1
symmnumber: 1
zpe: 613168.1 jmol-1
zpe.correction: 0.233543 hartree
zpe.thermalcorrener: 0.248353 hartree
zpe.thermalcorrenthalpy: 0.249297 hartree
zpe.thermalcorrgfe: 0.189628 hartree
zpe.sumelectzpe: -745.181106 hartree
zpe.sumelectthermal: -745.166296 hartree
zpe.sumelectthermalent: -745.165352 hartree
zpe.sumelectthermalfe: -745.225021 hartree
dipole: -1.3162 1.3534 0.9677
dipole: 2.1214
quadrupole: -76.5884 -96.5091 -99.3159
quadrupole: -5.1372 12.5135 -4.2833
quadrupole: 14.2160 -5.7046 -8.5114 -5.1372 12.5135 -4.2833
hfenergy: -745.4146492 hartree
pointgroup: C01 [X(C14H13N1O2)]
dipole: -0.503642 -0.601264 0.2853441 debye
polarizability: 279.180413|2.4824098|115.8019805|-7.5148659|-2.8575416|126.504114 unknown
InChI: InChI=1S/C14H13NO2/c1-16-13-9-7-11(8-10-13)14-15(17-14)12-5-3-2-4-6-12/h2-10,14H,1H3
charge 0 multiplicity 1
30 atoms
O  0.832018 1.80048 -0.932478
O  -5.230669 -0.674653 -0.24793
N  1.18382 0.799117 0.230673
C  0.33852 0.386088 -0.936818
C  -1.10528 0.128464 -0.722902
C  2.586215 0.395021 0.173152
C  -1.789597 -0.807706 -1.542346
C  -1.823877 0.81667 0.284888
C  3.521174 0.936733 -0.739286
C  2.991074 -0.547302 1.151309
C  -3.160682 -1.054476 -1.360126
C  -3.199143 0.581236 0.478512
C  -3.870123 -0.359235 -0.347763
C  4.867116 0.510725 -0.683362
C  4.335075 -0.97625 1.185182
C  5.278008 -0.449625 0.269621
C  -6.017704 0.015758 0.778722
H  0.841665 -0.23473 -1.696128
H  -1.246138 -1.346006 -2.328724
H  -1.290293 1.536717 0.913488
H  3.185848 1.688622 -1.459756
H  2.258088 -0.925006 1.871863
H  -3.702798 -1.772192 -1.982652
H  -3.734249 1.12505 1.262336
H  5.596395 0.93404 -1.383242
H  4.648269 -1.711059 1.935129
H  6.322964 -0.775902 0.307938
H  -6.026789 1.10977 0.609601
H  -5.632821 -0.201329 1.793826
H  -7.03658 -0.38452 0.674576
