program: Gaussian 09
title: 000018098
version: EM64L-G09RevD.01
frameworkgroup: C1[X(C7H7NO2)]
method: RPBEPBE
basis: SDD
operation: Freq
keyword: #pfreq=noraman
keyword: PBEPBE/SDD
title: #p freq=noraman PBEPBE/SDD
converged: NO YES NO NO
title: Mulliken charges:
elementType: O O N C C C C C C C H H H H H H H
charge: -0.195179 -0.192522 -0.197330 -0.436077 0.176035 0.195020 -0.247418 -0.253145 -0.022946 -0.545286 0.236737 0.247327 0.274682 0.274578 0.241110 0.220343 0.224069
chargesum: 0.00000
title: Mulliken charges with hydrogens summed into heavy atoms:
elementType: O O N C C C C C C C
charge: -0.195179 -0.192522 -0.197330 0.047987 0.176035 0.195020 0.027264 0.021433 0.218164 -0.100873
polarizability: 9.67603931e+01 1.27261321e+01 1.01490879e+02 2.55422328e+00 9.30665702e-01 4.94430857e+01
1716.lowfreq: -5.0890 0.0007 0.0009 0.0010 5.9739 10.9317 37.3604 63.6019 118.1485
frequency: 37.1108 63.5699 118.1384 151.9020 233.1726 295.8050 316.8634 364.8191 413.8257 545.2973 566.7458 616.4971 644.7445 688.1568 737.1427 762.7704 821.0772 868.5022 923.7633 937.9328 961.3208 999.3132 1012.2818 1024.6989 1094.3563 1118.9348 1174.2860 1281.6098 1285.2806 1313.3489 1326.8034 1366.2494 1428.9532 1447.7501 1581.0988 1620.2802 1662.9856 1673.8990 3011.1723 3080.4716 3092.3871 3115.8216 3202.5275 3203.9934 3232.7394
redmass: 3.9498 3.1913 3.1752 5.8530 3.4394 4.2477 6.1543 2.4479 2.7912 3.9595 2.8510 2.3279 3.2249 7.9244 7.1241 3.1473 2.1132 1.8667 2.0609 1.3090 1.3208 1.3461 1.7631 1.7386 2.9664 2.1670 2.5101 1.7027 1.2443 1.3768 2.0709 2.1840 1.1806 1.1175 6.9385 11.3980 4.6706 10.7341 1.0604 1.1004 1.0612 1.0960 1.1149 1.0894 1.1107
irintensity: 0.1806 1.1359 7.1572 4.9896 2.4027 0.0100 14.5304 1.7818 5.0442 0.0643 3.3474 9.4229 12.2416 35.4502 0.2496 9.4252 76.9116 16.1800 12.5204 0.0013 80.8107 7.2260 13.5826 18.0745 40.5932 0.7571 8.6588 0.0184 4.9875 23.4854 128.3221 111.3606 7.9619 41.0180 5.5461 453.8259 5.6657 0.9408 17.4604 0.3449 7.6503 7.0098 20.1746 0.0012 1.0319
temp: 298.150 k
press: 1.00000 atm
elementType: 8 8 7 6 6 6 6 6 6 6 1 1 1 1 1 1 1
symmnumber: 1
zpe: 331487.6 jmol-1
zpe.correction: 0.126257 hartree
zpe.thermalcorrener: 0.135564 hartree
zpe.thermalcorrenthalpy: 0.136508 hartree
zpe.thermalcorrgfe: 0.090689 hartree
zpe.sumelectzpe: -475.390601 hartree
zpe.sumelectthermal: -475.381294 hartree
zpe.sumelectthermalent: -475.380350 hartree
zpe.sumelectthermalfe: -475.426168 hartree
dipole: -0.8962 0.3098 -0.5404
dipole: 1.0914
quadrupole: -47.5968 -71.0819 -56.1371
quadrupole: -4.4031 1.8377 -0.0116
quadrupole: 10.6751 -12.8100 2.1349 -4.4031 1.8377 -0.0116
hfenergy: -475.5168575 hartree
pointgroup: C01 [X(C7H7N1O2)]
dipole: 0.3526 -0.1243195 -0.2111886 debye
dipolederiv: -0.4622258 0.0972739 0.0293057 -0.2478378 -1.034531 0.015197 0.0300063 -0.0670446 -0.3342275 -0.4699738 -0.3341992 0.0533613 0.0221623 -0.9252606 0.0312276 0.0609326 0.1169085 -0.3413979 -1.0899833 -0.0720591 0.1293616 0.0310026 -1.1216519 0.023847 0.211495 -0.0319087 -0.3069675 0.6716541 -0.0927088 -0.0301136 -0.1686984 0.1357063 0.0161319 -0.0945509 0.0834005 0.2630681 0.951073 0.1378336 -0.1637112 0.4826779 1.3586542 -0.0398895 -0.2112462 0.0027575 0.2985803 0.7481031 0.1561587 -0.1526002 -0.2944036 1.425952 -0.00032 -0.1869438 -0.0314029 0.3032812 -0.1145379 0.2443504 -0.0272749 0.1876736 -0.1141426 -0.0474791 -0.0003704 -0.0919193 -0.1302196 -0.2828629 -0.1748107 0.0167093 -0.0893257 0.0739553 0.0389562 0.0537959 0.0772523 -0.1420492 -0.0322016 0.1040621 0.1265283 0.0812781 -0.0240832 -0.1570174 0.1949254 -0.1385808 -0.022111 -0.2273198 0.0870877 0.1047499 0.1016053 -0.094935 -0.1886679 0.0686582 -0.1682965 -0.0553811 0.0061697 -0.0001059 0.0308585 -0.0408005 0.017406 0.1285414 0.0050505 0.0394902 0.0375882 -0.002907 -0.046704 -0.0600257 0.0549525 -0.0003812 -0.1055787 -0.0304004 -0.0484499 0.0424637 0.0147916 -0.0204106 0.0546968 -0.0438739 0.0932887 0.013518 0.0580909 0.0041508 0.1660098 0.0549815 0.0396574 0.0423234 0.066046 0.0480404 -0.0267794 0.0476414 -0.0165365 0.1682987 0.0874348 -0.0834026 -0.0054715 -0.0548743 0.0145188 0.1163121 -0.0571837 0.0862865 0.0119149 0.0220924 -0.0132818 -0.1224611 -0.0271085 0.1216675 0.0676163 -0.1475679 0.0571456 0.0107349 0.1257117 -0.0287412 -0.0262367 -0.0604756 0.0257962 0.1143844 -0.0023328 0.1267472 0.0304141 unknown
polarizability: 96.7025144|12.6748788|101.502801|-2.7960307|-1.7290514|49.4890419 unknown
InChI: InChI=1S/C7H7NO2/c1-2-5-8-6(9)3-4-7(8)10/h2-4H,1,5H2
charge 0 multiplicity 1
17 atoms
O  0.978422 2.289224 0.107916
O  -0.073808 -2.283504 0.337569
N  0.09224 0.09263 0.337149
C  -1.27013 0.431345 0.797166
C  1.09797 1.041791 0.015243
C  0.571791 -1.228334 0.123864
C  2.298107 0.243471 -0.434215
C  1.990129 -1.080429 -0.374137
C  -2.240927 0.622031 -0.355382
C  -3.346805 -0.137357 -0.542661
H  -1.610377 -0.382519 1.460521
H  -1.185098 1.364541 1.384847
H  3.226612 0.72559 -0.74049
H  2.605567 -1.946348 -0.61887
H  -2.004745 1.443538 -1.046229
H  -4.032085 0.044517 -1.378014
H  -3.594563 -0.966988 0.130722
