program: Gaussian 09
title: 000254563
version: EM64L-G09RevD.01
frameworkgroup: C1[X(C29H24O2)]
method: RPBEPBE
basis: SDD
operation: Freq
keyword: #pfreq=noraman
keyword: PBEPBE/SDD
title: #p freq=noraman PBEPBE/SDD
converged: YES YES NO NO
title: Mulliken charges:
elementType: O O C C C C C C C C C C C C C C C C C C C C C C C C C C C C C H H H H H H H H H H H H H H H H H H H H H H H H
charge: -0.230450 -0.238827 -0.370790 -0.453583 0.496890 -0.562418 0.048556 0.328395 0.144911 -0.388303 -0.451327 -0.385616 -0.354938 0.280805 0.356748 -0.232507 -0.228973 -0.400077 -0.417967 -0.247200 0.337264 -0.340087 -0.352301 -0.390285 -0.393483 -0.246558 -0.227815 -0.223020 -0.237441 -0.236404 -0.238584 0.282619 0.229601 0.236745 0.243355 0.277108 0.255993 0.250623 0.274860 0.251301 0.224243 0.224980 0.241100 0.240825 0.227226 0.253042 0.276251 0.240925 0.239999 0.231176 0.232954 0.233316 0.227776 0.227777 0.231586
chargesum: 0.00000
title: Mulliken charges with hydrogens summed into heavy atoms:
elementType: O O C C C C C C C C C C C C C C C C C C C C C C C C C C C C C
charge: -0.230450 -0.238827 -0.088170 0.012763 0.496890 -0.041954 0.048556 0.328395 0.144911 -0.132310 -0.200704 -0.110757 -0.103636 0.280805 0.356748 -0.008264 -0.003992 -0.158977 -0.177141 -0.019973 0.337264 -0.087044 -0.076050 -0.149360 -0.153484 -0.015381 0.005138 0.010296 -0.009665 -0.008628 -0.006998
polarizability: 3.78185509e+02 1.47880670e+01 3.39459928e+02 3.76061647e+01 -2.01346529e+01 2.78880188e+02
1716.lowfreq: -5.3455 -0.0006 -0.0003 -0.0001 3.4950 5.3010 9.5243 23.2291 26.4096
frequency: 9.3567 23.1751 26.4003 26.8648 35.7394 43.0676 52.0838 57.8332 73.6438 81.0932 86.0422 127.6684 138.9365 145.8008 163.0502 175.6887 183.6892 230.9722 266.7552 274.3450 287.5654 305.4972 349.1862 382.2626 387.5760 400.7471 402.9687 404.6904 406.8955 412.6588 426.0362 464.2239 467.9917 501.2766 519.4076 546.7349 567.3208 579.7201 611.3719 612.8399 613.9231 624.2474 634.4536 647.5724 678.5407 696.9632 701.1688 707.2841 710.2649 740.4666 744.6061 764.9374 767.3069 771.6015 793.9997 828.3175 844.6111 851.0118 858.7974 860.3278 863.4335 891.8835 923.7990 925.3636 943.2225 950.4213 968.1411 972.3146 975.8872 981.5742 988.2456 989.7477 990.4459 992.4362 994.8006 996.1234 996.3270 996.9298 997.9142 1010.8500 1017.7750 1026.7579 1027.7463 1040.2808 1051.7738 1081.3617 1085.5664 1085.6635 1114.2899 1122.9725 1164.1211 1171.6140 1173.0519 1174.4694 1188.3246 1188.7547 1190.5577 1193.3089 1202.8449 1205.0439 1233.8220 1247.4305 1266.5733 1291.7636 1304.7278 1312.5277 1314.9063 1328.2534 1335.4037 1346.3699 1357.4632 1360.9472 1376.6980 1382.6988 1387.5271 1417.9547 1434.5913 1437.4327 1439.2785 1442.9983 1443.5350 1475.4149 1479.9112 1480.1592 1512.1403 1541.4097 1565.8598 1573.7188 1587.8041 1592.1033 1597.0227 1609.7994 1611.3894 1611.8747 1618.1702 2975.4093 3010.6806 3022.8285 3029.3695 3075.3529 3116.2593 3120.5507 3124.6232 3128.6451 3129.0899 3133.0768 3135.9240 3138.8468 3139.2093 3143.0113 3143.7992 3150.6986 3150.9321 3159.4809 3159.7723 3161.5909 3166.2239 3168.4257 3169.7214
redmass: 6.3597 4.7235 4.6059 4.9886 4.2902 4.0256 5.7095 6.6188 4.0527 4.8023 6.9998 5.1703 6.0484 5.4812 4.5430 4.9279 3.6077 4.7899 2.8591 4.9953 5.0383 4.3441 5.0024 4.9336 4.2054 2.8066 2.8348 2.8409 2.8465 2.9539 4.2727 5.7085 4.9011 4.3834 3.5275 3.0240 2.5987 4.0109 5.5817 6.4867 6.4190 4.6738 6.9240 5.3198 5.1735 1.8304 1.7459 2.5969 2.0369 3.3958 3.6501 1.8788 2.3526 1.8740 3.2808 2.5898 1.5207 1.2552 1.2481 1.2776 1.5543 3.0504 1.4554 1.4963 1.5282 3.4260 1.4334 3.0534 1.5263 1.4044 4.4583 5.8847 5.4886 1.3948 2.7126 1.3734 3.2470 1.4002 1.5103 1.3929 2.5613 2.1852 2.0954 1.9361 2.3560 1.6165 1.6025 1.6269 3.0921 1.3836 1.2002 1.0560 1.0684 1.0535 1.1342 1.3038 1.2653 1.3785 1.3996 1.4534 2.3713 1.8247 1.7788 2.8369 1.3623 1.5346 1.3714 1.4471 1.3623 1.5716 1.5901 2.1311 9.4212 6.5679 9.2628 4.1188 1.7580 2.3703 1.3053 2.1143 1.1011 2.1395 2.1958 2.2381 2.8153 7.2632 6.6009 6.8532 6.5540 6.0157 6.6536 6.0053 6.0137 6.3023 6.3866 1.0619 1.0651 1.0841 1.0882 1.1027 1.0864 1.0870 1.0846 1.0851 1.0876 1.0915 1.0879 1.0889 1.0881 1.0912 1.0960 1.0924 1.0963 1.0953 1.0959 1.1014 1.1012 1.0958 1.1012
irintensity: 0.1818 0.9536 0.4719 0.5345 0.5933 0.0758 0.2926 1.3311 0.3573 0.0948 3.3606 0.0914 6.9852 1.4354 0.9667 1.4584 2.2450 6.5614 0.8414 0.8473 0.1176 10.7655 8.1606 2.3211 1.5346 0.0456 0.1555 0.1090 0.3976 2.4184 0.5292 4.2178 14.9326 0.6903 25.3104 14.9083 3.2806 15.8192 0.3570 0.0355 0.3607 2.5880 0.2284 7.3044 0.5526 47.2610 40.4771 27.1046 41.6905 32.8786 46.2494 96.1816 23.8169 35.6120 2.2245 11.5909 6.5069 0.8061 0.4769 1.5271 25.4279 31.4863 2.0551 4.7245 2.7111 55.7226 1.8207 34.1371 5.7616 0.4480 1.3399 2.1219 0.1886 0.2652 15.1876 0.8670 12.4628 2.4604 0.5657 1.3148 3.1496 1.5590 7.7077 2.2865 7.8664 12.3955 10.1251 4.9947 3.4960 12.7488 8.2955 0.5060 6.4518 0.0497 40.4442 53.1696 18.9219 15.8762 94.9770 26.9717 123.2230 51.1419 149.6867 2.4616 9.9209 20.1252 1.0689 83.9049 20.8122 31.5568 6.6144 22.5400 1.3556 1.3890 3.4521 16.8440 25.2858 10.1237 29.0184 8.0353 28.0214 8.9312 1.9469 24.7400 9.8946 135.6010 91.4485 99.5232 6.0816 3.6839 33.3205 20.7352 0.1741 7.3431 71.1628 52.2224 8.9756 12.1528 33.8079 6.7839 6.3016 0.5459 6.6043 0.1139 1.1035 10.8966 7.2584 16.8755 6.9807 5.0175 31.7365 16.4214 34.0126 13.5687 21.8551 30.2678 30.6853 4.3575 21.9729
temp: 298.150 k
press: 1.00000 atm
elementType: 8 8 6 6 6 6 6 6 6 6 6 6 6 6 6 6 6 6 6 6 6 6 6 6 6 6 6 6 6 6 6 1 1 1 1 1 1 1 1 1 1 1 1 1 1 1 1 1 1 1 1 1 1 1 1
symmnumber: 1
zpe: 1155167.5 jmol-1
zpe.correction: 0.439980 hartree
zpe.thermalcorrener: 0.466331 hartree
zpe.thermalcorrenthalpy: 0.467275 hartree
zpe.thermalcorrgfe: 0.378702 hartree
zpe.sumelectzpe: -1267.811646 hartree
zpe.sumelectthermal: -1267.785295 hartree
zpe.sumelectthermalent: -1267.784351 hartree
zpe.sumelectthermalfe: -1267.872924 hartree
dipole: -0.6965 -2.1443 -0.4938
dipole: 2.3080
quadrupole: -155.7144 -163.2153 -175.9349
quadrupole: -8.2528 8.0415 -5.6436
quadrupole: 9.2405 1.7395 -10.9800 -8.2528 8.0415 -5.6436
hfenergy: -1268.2516262 hartree
pointgroup: C01 [X(C29H24O2)]
dipole: -0.879411 -0.1272493 -0.1870878 debye
polarizability: 359.1553127|-24.8636161|361.940145|-3.2955469|-38.6975873|275.4301677 unknown
InChI: InChI=1S/C29H24O2/c30-28(25-14-8-3-9-15-25)21-20-27(24-12-6-2-7-13-24)29(31)26-18-16-23(17-19-26)22-10-4-1-5-11-22/h1-19,27H,20-21H2
charge 0 multiplicity 1
55 atoms
O  1.095746 -0.518669 2.463696
O  1.554322 -2.902302 -1.694829
C  1.984047 -0.462226 0.186476
C  2.794737 -1.728458 0.578723
C  2.940418 0.701888 -0.112328
C  1.948964 -3.00924 0.713281
C  0.974255 -0.065039 1.28255
C  -0.14694 0.873164 0.947472
C  1.355292 -3.518083 -0.602441
C  3.527944 1.454153 0.93707
C  3.303783 0.995729 -1.45133
C  -1.070859 1.2186 1.9720
C  -0.335091 1.43001 -0.346648
C  0.534011 -4.778791 -0.584428
C  -2.338385 2.64826 0.418259
C  4.450072 2.485649 0.652045
C  4.22917 2.024115 -1.737713
C  -2.143325 2.086848 1.713623
C  -1.410646 2.299636 -0.60323
C  4.803849 2.775434 -0.68616
C  -3.475059 3.570471 0.141322
C  0.26627 -5.498118 0.61218
C  0.011181 -5.264576 -1.814272
C  -3.348001 4.622625 -0.808498
C  -4.717798 3.425079 0.819278
C  -0.506666 -6.678388 0.577023
C  -0.759745 -6.442717 -1.848995
C  -1.020564 -7.153778 -0.652103
C  -4.423495 5.496764 -1.071341
C  -5.79449 4.297994 0.556368
C  -5.653278 5.339034 -0.390607
H  1.43307 -0.697471 -0.742663
H  3.572505 -1.878951 -0.191992
H  3.300984 -1.539017 1.542431
H  2.576055 -3.820338 1.137623
H  1.138474 -2.850806 1.451752
H  3.259847 1.233911 1.977539
H  2.869157 0.40576 -2.268012
H  -0.914474 0.794505 2.969376
H  0.358187 1.189789 -1.157828
H  4.89212 3.062811 1.472267
H  4.502928 2.237607 -2.777378
H  -2.822383 2.361601 2.528291
H  -1.55222 2.690569 -1.616532
H  5.519088 3.575736 -0.907059
H  0.654765 -5.140939 1.571273
H  0.227596 -4.696094 -2.724987
H  -2.391284 4.777639 -1.319787
H  -4.852536 2.603476 1.531691
H  -0.709434 -7.22643 1.503597
H  -1.157822 -6.809465 -2.801444
H  -1.62049 -8.070474 -0.67744
H  -4.299876 6.306382 -1.799225
H  -6.74564 4.160969 1.082773
H  -6.488837 6.017565 -0.594711
