program: Gaussian 09
title: 000254482
version: EM64L-G09RevD.01
frameworkgroup: C1[X(C10H17N3O4)]
method: RPBEPBE
basis: SDD
operation: Freq
keyword: #p
keyword: freq=noraman
keyword: PBEPBE/SDD
title: #p freq=noraman PBEPBE/SDD
converged: YES YES NO NO
title: Mulliken charges:
elementType: O O O O N N N C C C C C C C C C C H H H H H H H H H H H H H H H H H
charge: -0.270202 -0.327409 -0.406006 -0.235683 -0.410361 -0.367703 -0.519766 0.241797 -0.606050 -0.487303 -0.406557 -0.436013 0.216048 0.254882 -0.444013 -0.523148 0.205261 0.287686 0.221575 0.271190 0.222581 0.217451 0.220466 0.217581 0.222243 0.307663 0.369085 0.263419 0.286434 0.220908 0.247492 0.293342 0.273004 0.380107
chargesum: 0.00000
title: Mulliken charges with hydrogens summed into heavy atoms:
elementType: O O O O N N N C C C C C C C C C C
charge: -0.270202 -0.327409 -0.025899 -0.235683 -0.102697 0.001382 0.046580 0.241797 -0.096789 0.006468 0.031359 0.003811 0.216048 0.254882 0.105841 -0.054748 0.205261
polarizability: 1.58094737e+02 -6.08948128e+00 1.41992854e+02 -9.37823953e+00 1.11458457e+00 1.14994364e+02
1716.lowfreq: -57.2444 -13.9584 -9.1361 -5.6191 -0.0002 0.0005 0.0006 21.4090 27.6556
frequency: -56.5854 20.7473 27.4506 36.0371 42.4651 64.2373 83.5118 100.7321 144.7694 147.9767 170.2010 222.0048 241.1871 272.6431 282.7437 307.2201 308.7869 332.5228 368.6810 401.6761 467.5669 502.4406 526.7322 560.7541 591.4047 594.0633 624.8466 654.6305 678.8386 705.8224 721.7395 748.6169 767.9876 790.4592 807.9086 827.9250 872.2607 888.5089 889.9789 908.8655 919.3102 958.8255 973.6157 1004.3851 1030.2198 1038.6124 1070.9393 1081.8314 1107.4646 1131.7220 1140.8938 1152.1344 1187.2830 1197.8701 1215.2598 1237.2742 1247.6147 1260.1985 1268.6018 1285.4482 1298.0928 1311.0340 1312.3535 1321.4528 1326.2296 1336.6456 1344.4195 1427.5141 1435.7159 1460.4923 1469.1119 1471.4471 1485.4115 1499.5742 1550.5702 1589.2258 1620.6784 1659.3254 1661.5846 2979.9810 2995.2313 2998.6751 3006.6309 3011.1177 3019.3862 3037.6742 3050.7757 3060.0423 3073.1563 3089.5458 3098.4014 3218.5025 3447.5639 3509.8172 3513.2418 3565.4103
redmass: 1.7627 4.8546 5.5099 9.1291 3.1240 5.9602 3.0436 4.9647 4.0164 3.2435 3.0099 3.3674 1.2504 4.5890 3.7274 3.5548 4.6279 4.8523 3.6868 4.0235 2.2503 2.7697 4.0312 2.9357 3.2893 1.2725 2.6707 1.5566 1.9219 2.6142 6.1475 3.0201 2.2488 1.9163 4.5220 1.9594 1.4642 1.7646 1.9022 3.4532 2.3313 2.3210 2.5530 1.8999 2.7592 1.8389 2.8907 2.2492 3.1886 2.0293 2.6255 1.8805 1.4155 1.4954 1.4930 1.3531 1.7749 1.4194 1.5758 1.4989 1.4572 2.2313 1.4834 1.3631 1.4861 1.3007 1.2782 1.0848 1.0886 1.2687 1.1906 1.1314 1.1577 1.2272 1.8840 5.8411 3.5594 4.9015 1.1999 1.0601 1.0608 1.0612 1.0642 1.0647 1.0670 1.1021 1.1012 1.0990 1.1014 1.0982 1.1011 1.0879 1.0457 1.0638 1.0770 1.0959
irintensity: 0.1443 0.2080 0.1804 2.3814 0.1643 4.2145 0.3139 1.8095 3.3690 2.6291 12.2373 4.3189 75.8867 3.7110 7.3336 8.0857 21.6022 24.1650 4.8208 6.7444 12.5919 12.2358 39.7358 38.5793 52.4447 53.0490 2.5597 122.7727 156.2839 3.7765 16.6225 202.8731 15.4841 2.9977 12.4945 5.4719 41.1447 30.4551 15.4542 28.6605 5.9680 2.2115 4.0316 8.0113 12.8175 0.6902 28.5374 149.0365 4.3065 2.0946 3.9305 4.8090 3.3211 6.7199 12.2083 0.8472 66.3464 37.0942 10.9020 9.7289 9.7914 32.5897 7.9290 4.9324 7.8563 4.3302 8.5994 23.5628 11.3032 70.6094 63.5715 26.7303 36.3797 18.4042 273.8636 49.2962 196.0288 219.4348 126.9133 27.5364 47.6630 14.8198 51.5630 21.6884 40.7767 18.6162 4.5448 3.3579 26.8306 24.5723 22.6282 387.9004 2.4747 23.6842 16.0600 3.3286
temp: 298.150 k
press: 1.00000 atm
elementType: 8 8 8 8 7 7 7 6 6 6 6 6 6 6 6 6 6 1 1 1 1 1 1 1 1 1 1 1 1 1 1 1 1 1
symmnumber: 1
zpe: 726566.8 jmol-1
zpe.correction: 0.276735 hartree
zpe.thermalcorrener: 0.294110 hartree
zpe.thermalcorrenthalpy: 0.295054 hartree
zpe.thermalcorrgfe: 0.228821 hartree
zpe.sumelectzpe: -855.119343 hartree
zpe.sumelectthermal: -855.101968 hartree
zpe.sumelectthermalent: -855.101024 hartree
zpe.sumelectthermalfe: -855.167257 hartree
dipole: 3.5270 1.9436 -0.9962
dipole: 4.1485
quadrupole: -104.4213 -114.0898 -97.3906
quadrupole: -7.6973 1.4023 -7.0589
quadrupole: 0.8792 -8.7892 7.9100 -7.6973 1.4023 -7.0589
hfenergy: -855.3960779 hartree
pointgroup: C01 [X(C10H17N3O4)]
dipole: 1.561516 -0.0173997 0.4745896 debye
polarizability: 147.7950152|8.4550309|149.3146286|10.3636752|10.456898|117.9723111 unknown
InChI: InChI=1S/C10H17N3O4/c11-5-7(14)13-10(3-1-2-4-10)9(17)12-6-8(15)16/h12-13,15H,1-6,11H2
charge 0 multiplicity 1
34 atoms
O  -1.727985 1.796393 0.756817
O  0.833968 -1.3328 -1.502353
O  -2.51519 -2.02805 0.430426
O  -4.505675 -1.882893 -0.755867
N  1.216258 -0.184594 0.499501
N  -1.420177 0.137359 -0.848231
N  1.893378 -3.747772 -0.354821
C  0.597354 1.143957 0.186474
C  1.028239 2.138538 1.294922
C  1.240945 1.76976 -1.091695
C  2.440672 2.661488 0.885922
C  2.6316 2.259777 -0.614583
C  -0.957844 1.048857 0.076408
C  1.352445 -1.268258 -0.333762
C  -2.846589 -0.086846 -1.022995
C  2.212763 -2.437357 0.213308
C  -3.388507 -1.40258 -0.467418
H  0.281941 2.949153 1.317073
H  1.005054 1.676745 2.30018
H  1.286805 1.061721 -1.934026
H  0.60981 2.625209 -1.398114
H  3.237723 2.223577 1.513756
H  2.496279 3.756122 1.020117
H  2.99922 3.09888 -1.23067
H  3.370986 1.442942 -0.703927
H  1.582661 -0.278865 1.450664
H  -0.724375 -0.45466 -1.344835
H  -3.137994 -0.046586 -2.08792
H  -3.379042 0.732942 -0.501196
H  2.129887 -2.48583 1.316379
H  3.271725 -2.200656 -0.011446
H  1.985973 -3.759288 -1.377122
H  0.965361 -4.089276 -0.080143
H  -2.957968 -2.851012 0.775977
