program: Gaussian 09
title: 000250405
version: EM64L-G09RevD.01
frameworkgroup: C1[X(C20H22N2O4)]
method: RPBEPBE
basis: SDD
operation: Freq
keyword: #p
keyword: freq=noraman
keyword: PBEPBE/SDD
title: #p freq=noraman PBEPBE/SDD
converged: NO YES NO NO
title: Mulliken charges:
elementType: O O O O N N C C C C C C C C C C C C C C C C C C C C H H H H H H H H H H H H H H H H H H H H H H
charge: -0.255499 -0.276073 -0.292145 -0.259306 -0.231796 -0.451709 -0.438325 -0.547670 0.454888 0.223083 -0.348477 -0.324758 0.246460 0.236208 -0.358724 -0.367160 -0.832460 0.485559 0.179392 -0.444998 -0.344566 -0.196106 -0.213441 -0.250984 -0.257014 -0.666479 0.227773 0.286194 0.247623 0.244517 0.230897 0.287202 0.271000 0.271524 0.311359 0.290616 0.231662 0.265514 0.222332 0.305669 0.229363 0.228827 0.231375 0.220685 0.235584 0.217468 0.251702 0.223213
chargesum: 0.00000
title: Mulliken charges with hydrogens summed into heavy atoms:
elementType: O O O O N N C C C C C C C C C C C C C C C C C C C C
charge: -0.255499 -0.276073 -0.292145 -0.259306 -0.231796 -0.140350 0.075642 -0.055529 0.454888 0.223083 -0.117580 -0.037556 0.246460 0.236208 -0.087724 -0.095635 -0.044669 0.485559 0.179392 -0.222665 -0.038897 0.033257 0.015386 -0.019609 0.199255 0.025903
polarizability: 3.13372837e+02 4.48577632e+01 2.59842841e+02 -3.20518472e+01 2.56775497e+01 1.92856620e+02
1716.lowfreq: -7.6399 0.0007 0.0008 0.0008 1.8599 4.1222 9.4688 15.5172 22.1544
frequency: 8.4215 15.4607 22.1285 31.6028 41.8436 55.7024 67.4116 74.4686 84.8049 88.1464 96.8521 105.2423 124.2888 173.8317 184.2737 208.1817 220.7496 244.8417 254.3108 272.2081 304.1331 311.1790 323.4029 337.9083 348.4368 391.7440 405.5369 407.6458 407.9033 438.2037 452.6074 480.8065 502.1896 506.4437 538.3615 570.4978 577.9505 599.8433 613.7150 616.1583 631.0230 655.2010 677.4535 680.8147 695.1925 696.9098 754.9727 758.7216 771.2606 815.5300 819.9140 835.4126 840.7621 844.0018 847.6269 862.6077 892.7952 920.3624 930.5821 973.9430 974.6202 984.7932 986.7625 987.4902 997.7104 1000.6477 1005.3893 1011.8966 1026.6511 1041.7052 1054.3440 1062.6734 1089.7738 1095.2474 1110.5699 1136.1400 1154.7450 1164.2946 1173.4288 1188.0080 1190.9379 1207.9868 1218.9210 1244.2716 1256.2093 1261.3525 1279.2332 1308.4529 1316.5362 1326.8824 1352.0900 1355.5958 1357.5795 1381.1678 1387.5961 1388.5069 1388.8026 1421.4738 1429.2187 1442.6895 1455.5161 1462.0204 1462.3063 1472.7163 1484.1111 1484.7226 1501.4489 1501.9906 1515.4892 1567.0036 1595.7543 1601.0633 1613.3596 1618.1881 1619.0904 1621.7938 2984.4298 2991.4421 2991.6636 3010.9821 3028.2662 3055.1051 3072.4911 3085.9741 3091.8599 3111.5750 3117.3736 3127.6758 3133.3191 3134.4550 3146.9439 3149.2697 3157.6262 3167.0881 3176.5617 3197.3670 3209.1088 3524.6365
redmass: 6.0004 5.0999 4.2459 4.4858 4.4970 3.6391 5.7091 4.8697 5.0027 5.3651 4.2660 5.2184 3.5997 4.8765 3.5253 2.8941 1.7323 1.0850 4.1123 3.6446 3.2623 3.5976 4.3082 5.2652 5.0963 3.3337 3.1556 3.0232 2.9593 3.2861 3.6064 5.0633 2.8646 3.4026 3.4805 3.9981 3.5004 4.0241 6.2257 5.0603 6.9291 1.1949 3.6019 3.5519 4.1984 1.9885 3.3402 3.9002 1.7017 1.4492 5.1546 1.4900 2.4637 1.2716 2.3480 2.3722 3.9170 1.4366 2.9005 1.3620 1.3579 4.5383 1.3733 2.1563 3.3420 1.3118 2.2894 2.7227 2.1088 1.6604 2.9206 3.0570 1.5499 2.1632 3.0580 1.5702 1.6754 1.7519 1.0535 1.1242 1.2165 1.9227 1.9081 2.3454 3.3643 1.9080 1.1156 1.4303 1.4572 1.9773 1.3813 1.4254 1.3537 4.0463 3.4442 1.4918 1.2935 3.7192 2.3288 1.1215 1.1001 1.0815 1.0449 1.0610 2.3180 1.0596 2.1668 1.2098 2.0496 7.4855 7.2393 6.7344 4.9561 7.6396 5.0669 7.2120 1.0385 1.0608 1.0361 1.0713 1.0592 1.1007 1.0988 1.0978 1.1031 1.0889 1.1057 1.0978 1.0904 1.0868 1.0934 1.0879 1.0911 1.0999 1.0956 1.0951 1.0945 1.0765
irintensity: 1.3958 1.6806 0.4578 0.4613 0.3365 0.3039 3.5533 2.6969 0.9773 1.0155 5.1729 4.9672 2.1910 2.1372 4.9034 6.4408 3.9834 0.8308 3.0316 2.2036 12.8028 11.2218 2.2680 1.4452 1.2411 11.8655 2.4432 1.4712 5.3794 20.6303 6.2293 8.3039 20.0954 4.9748 2.9591 0.9437 3.8819 8.2664 0.8876 1.4426 3.3910 41.2856 16.9050 20.9637 2.3328 51.7692 15.6654 8.5845 94.3982 0.2432 1.0649 12.0270 9.8731 1.5923 28.3568 19.6565 17.9114 12.5442 12.1497 3.7599 0.2206 11.0283 3.5785 65.0077 7.6772 2.6843 5.2868 56.3266 4.2046 26.6775 85.9679 262.8165 17.1924 22.6242 11.9667 20.8929 68.7352 63.3064 0.0387 3.7289 122.5624 56.3573 165.9654 19.8223 318.0631 11.8336 1.6484 69.7185 73.1776 241.0814 7.5809 10.2490 17.2220 6.0126 64.8054 58.2163 18.3037 5.1918 90.7869 15.1567 31.9004 30.6841 15.2238 19.7363 57.0492 17.9193 41.3975 68.3488 271.5358 29.7968 162.7585 60.4022 49.9098 78.3892 47.5479 308.9017 11.9359 8.4321 25.2207 47.2702 40.1111 15.3165 4.2703 41.9423 3.0306 13.9448 32.2646 8.2420 3.4996 0.6342 26.4615 10.7201 0.9973 22.8572 4.7127 6.5852 0.5160 11.2138
temp: 298.150 k
press: 1.00000 atm
elementType: 8 8 8 8 7 7 6 6 6 6 6 6 6 6 6 6 6 6 6 6 6 6 6 6 6 6 1 1 1 1 1 1 1 1 1 1 1 1 1 1 1 1 1 1 1 1 1 1
symmnumber: 1
zpe: 1007367.6 jmol-1
zpe.correction: 0.383686 hartree
zpe.thermalcorrener: 0.408724 hartree
zpe.thermalcorrenthalpy: 0.409668 hartree
zpe.thermalcorrgfe: 0.324112 hartree
zpe.sumelectzpe: -1183.872712 hartree
zpe.sumelectthermal: -1183.847674 hartree
zpe.sumelectthermalent: -1183.846730 hartree
zpe.sumelectthermalfe: -1183.932286 hartree
dipole: 0.1703 2.0641 -5.8968
dipole: 6.2499
quadrupole: -145.8982 -144.4019 -157.7076
quadrupole: 0.3187 -15.0930 9.9573
quadrupole: 3.4377 4.9340 -8.3717 0.3187 -15.0930 9.9573
hfenergy: -1184.2563984 hartree
pointgroup: C01 [X(C20H22N2O4)]
dipole: 0.5975719 -1.3946423 1.9349582 debye
polarizability: 310.7030857|38.7368161|211.9900931|20.7680179|53.5675277|243.3791189 unknown
InChI: InChI=1S/C20H22N2O4/c1-3-26-20(25)16-9-11-18(12-10-16)22(15(2)23)14-13-19(24)21-17-7-5-4-6-8-17/h4-12,21H,3,13-14H2,1-2H3
charge 0 multiplicity 1
48 atoms
O  -2.83892 1.93629 -1.557694
O  -2.844164 -2.688669 -0.4306
O  3.056066 3.404938 2.647765
O  3.529056 3.620294 0.369327
N  -2.331114 0.663625 0.34723
N  -0.498837 -2.764893 -0.303828
C  -2.748144 -0.366903 1.335314
C  -1.747019 -1.540874 1.43219
C  -1.075382 1.331916 0.578331
C  -3.161781 1.014241 -0.755281
C  -0.630328 1.568145 1.910077
C  -0.239041 1.73307 -0.502156
C  -1.754624 -2.377364 0.143534
C  1.437783 2.585716 1.081206
C  0.607828 2.187505 2.159076
C  0.997175 2.350447 -0.247223
C  -4.467073 0.243703 -0.934332
C  -0.155824 -3.584557 -1.422193
C  2.75688 3.241992 1.287258
C  1.226846 -3.811919 -1.658132
C  -1.125113 -4.167171 -2.281109
C  1.639304 -4.614826 -2.739993
C  -0.694257 -4.970011 -3.359698
C  0.679644 -5.200831 -3.598485
C  4.364795 4.052903 2.960919
C  5.494574 3.018969 2.984197
H  -2.887152 0.087246 2.333984
H  -3.718416 -0.778841 1.029721
H  -2.073637 -2.199348 2.261276
H  -0.736476 -1.171845 1.684369
H  -1.258453 1.289249 2.761465
H  -0.567153 1.571929 -1.52895
H  0.936596 2.374905 3.184852
H  1.644437 2.658101 -1.07497
H  0.296091 -2.403375 0.229263
H  -4.296424 -0.845008 -1.014523
H  -5.173761 0.427424 -0.10367
H  -4.925942 0.610253 -1.864178
H  1.97803 -3.358607 -0.997918
H  -2.184768 -3.98346 -2.097313
H  2.708199 -4.780892 -2.912496
H  -1.445411 -5.416916 -4.020461
H  0.999267 -5.824354 -4.440001
H  4.199026 4.50748 3.950989
H  4.557412 4.837073 2.207804
H  6.437666 3.504482 3.297447
H  5.647431 2.585757 1.981661
H  5.271805 2.206104 3.697146
