program: Gaussian 09
title: 000250401
version: EM64L-G09RevD.01
frameworkgroup: C1[X(C10H10F3NO3)]
method: RPBEPBE
basis: SDD
operation: Freq
keyword: #p
keyword: freq=noraman
keyword: PBEPBE/SDD
title: #p freq=noraman PBEPBE/SDD
converged: NO YES NO NO
title: Mulliken charges:
elementType: F F F O O O N C C C C C C C C C C H H H H H H H H H H
charge: -0.167086 -0.161633 -0.160819 -0.405768 -0.427218 -0.226362 -0.619222 -0.602318 0.516117 -0.137829 -0.505959 0.156938 -0.393413 0.203174 -0.368578 0.223311 0.272088 0.202064 0.261856 0.242894 0.306760 0.236334 0.225352 0.301887 0.279505 0.365284 0.382641
chargesum: 0.00000
title: Mulliken charges with hydrogens summed into heavy atoms:
elementType: F F F O O O N C C C C C C C C C C
charge: -0.167086 -0.161633 -0.160819 -0.040484 -0.044577 -0.226362 -0.037830 -0.138398 0.516117 0.105064 -0.199198 0.156938 -0.157079 0.203174 -0.143226 0.223311 0.272088
polarizability: 1.60902326e+02 1.06759176e+00 1.26915740e+02 -1.11300794e+01 6.08798024e+00 8.59976087e+01
1716.lowfreq: -5.3759 -4.3976 -0.0003 -0.0001 0.0007 6.3630 17.1613 32.0018 43.5804
frequency: 16.8693 31.9572 43.5654 62.6816 78.8805 109.0986 147.8061 165.6241 208.2551 243.6622 252.2836 290.7238 298.9159 307.7632 333.0263 346.1287 349.1250 355.2356 429.4325 435.6730 472.9019 507.3988 522.7785 536.9726 551.8867 565.5006 619.9261 629.4652 633.5408 697.6749 712.4434 738.0616 769.8444 790.5963 811.9432 875.4410 925.8339 943.8086 950.3934 990.9103 997.7613 999.1248 1034.4239 1048.0003 1094.2888 1108.1640 1159.9345 1168.7668 1200.9489 1210.6824 1257.9202 1261.9976 1274.8673 1286.4493 1306.9067 1334.3218 1382.2905 1395.8076 1427.8723 1460.3531 1503.5164 1606.1832 1625.6405 1627.5715 1676.3410 2882.2437 2995.5207 3075.4217 3116.1561 3138.9416 3176.3657 3469.9983 3512.6739 3583.1378 3604.0694
redmass: 6.6270 8.3991 9.6009 9.1448 5.6069 5.8203 8.6310 6.1635 7.6812 1.2210 4.2793 4.1801 6.8582 4.8364 4.0238 1.9722 1.6560 4.2132 5.6482 6.5884 3.9395 4.3475 5.4042 4.3261 4.4772 1.3266 10.4465 4.3900 1.3663 6.0160 4.6750 4.3168 3.9655 2.9089 1.7298 5.2643 1.5834 1.8450 1.4275 3.1272 7.8940 6.5916 4.4471 2.5007 2.3574 2.0057 1.2358 1.1441 2.0261 1.3993 1.7024 2.6171 2.6892 1.4074 1.4353 1.5143 2.2893 4.3847 3.6794 1.1058 2.9758 6.6064 4.7167 1.1848 9.0808 1.0807 1.0644 1.0980 1.0873 1.0971 1.0924 1.0445 1.0640 1.0664 1.0991
irintensity: 0.4667 0.7924 0.2311 1.1860 1.9008 1.6827 2.0963 0.1675 2.7443 48.0130 3.7749 3.2442 2.0286 13.0129 6.3824 54.3271 80.8209 2.9300 0.0715 11.7095 9.2790 40.1685 9.1756 56.9687 10.2178 66.4015 18.6885 33.1251 257.5955 4.1484 33.0017 0.1150 15.4682 23.5616 26.8678 23.7649 25.1985 9.7096 34.6842 97.9550 177.4526 128.7604 59.4533 317.3497 128.0483 70.0389 47.3655 8.8664 80.6839 2.5304 30.0495 36.5600 111.2478 34.8228 62.6836 14.6801 35.6010 11.6327 60.7660 17.0147 85.0640 22.0367 58.4341 23.2105 193.9363 67.4030 31.2478 6.6108 14.2090 14.0209 2.8236 3.5204 26.5911 53.7402 5.0509
temp: 298.150 k
press: 1.00000 atm
elementType: 9 9 9 8 8 8 7 6 6 6 6 6 6 6 6 6 6 1 1 1 1 1 1 1 1 1 1
symmnumber: 1
zpe: 500988.2 jmol-1
zpe.correction: 0.190816 hartree
zpe.thermalcorrener: 0.207502 hartree
zpe.thermalcorrenthalpy: 0.208447 hartree
zpe.thermalcorrgfe: 0.144603 hartree
zpe.sumelectzpe: -965.748163 hartree
zpe.sumelectthermal: -965.731477 hartree
zpe.sumelectthermalent: -965.730532 hartree
zpe.sumelectthermalfe: -965.794375 hartree
dipole: 4.3257 5.8672 1.9479
dipole: 7.5452
quadrupole: -95.3524 -84.0386 -98.0665
quadrupole: -8.7634 0.7587 -0.9416
quadrupole: -2.8665 8.4472 -5.5807 -8.7634 0.7587 -0.9416
hfenergy: -965.9389789 hartree
pointgroup: C01 [X(C10H10F3N1O3)]
dipole: -1.6811331 2.3101787 -0.8055989 debye
polarizability: 161.9685645|-0.1103641|127.2011727|-6.5481812|-5.1110386|84.6459375 unknown
InChI: InChI=1S/C10H10F3NO3/c11-10(12,13)6-3-5(1-2-8(6)15)4-7(14)9(16)17/h1-3,7,15-16H,4,14H2
charge 0 multiplicity 1
27 atoms
F  2.012795 -2.238467 0.796371
F  3.172663 -1.403035 -0.958436
F  3.717388 -0.796676 1.157425
O  3.406433 1.494592 -0.622423
O  -3.663635 -1.342889 -1.717997
O  -2.171457 -1.946076 -0.046465
N  -4.444333 0.553443 0.237658
C  -2.085874 0.764387 0.988953
C  -0.637683 0.963547 0.564735
C  -3.035679 0.398206 -0.182743
C  0.298705 -0.096579 0.618824
C  1.642259 0.086497 0.224138
C  -0.189973 2.225228 0.098053
C  2.069718 1.359058 -0.243708
C  1.145062 2.426769 -0.304833
C  -2.86859 -1.069884 -0.594292
C  2.615995 -1.055157 0.30131
H  -2.467588 1.704125 1.434014
H  -2.172744 -0.022058 1.757895
H  -2.761794 1.017425 -1.07149
H  -0.029084 -1.082576 0.959556
H  -0.891171 3.067762 0.057942
H  1.472647 3.412263 -0.658952
H  -5.127595 0.287589 -0.477284
H  -4.650419 1.450521 0.685484
H  3.603089 2.413576 -0.931152
H  -3.581736 -2.305889 -1.957786
