program: Gaussian 09
title: 000250399
version: EM64L-G09RevD.01
frameworkgroup: C1[X(C13H13NO2)]
method: RPBEPBE
basis: SDD
operation: Freq
keyword: #p
keyword: freq=noraman
keyword: PBEPBE/SDD
title: #p freq=noraman PBEPBE/SDD
converged: YES YES NO NO
title: Mulliken charges:
elementType: O O N C C C C C C C C C C C C C H H H H H H H H H H H H H
charge: -0.399918 -0.247688 -0.572549 -0.603976 0.526801 -0.189117 0.367727 -0.609979 0.379298 -0.412628 -0.420761 -0.423669 -0.407412 0.203455 -0.243525 -0.243796 0.213438 0.228445 0.262421 0.253937 0.228709 0.233888 0.240574 0.236784 0.277497 0.289571 0.227594 0.227355 0.377522
chargesum: 0.00000
title: Mulliken charges with hydrogens summed into heavy atoms:
elementType: O O N C C C C C C C C C C C C C
charge: -0.022396 -0.247688 -0.005481 -0.162092 0.526801 0.073304 0.367727 -0.356043 0.379298 -0.183918 -0.186873 -0.183095 -0.170628 0.203455 -0.015931 -0.016441
polarizability: 2.22704111e+02 2.62712619e+01 1.48643566e+02 -2.35461056e+01 1.87331462e+01 9.86186472e+01
1716.lowfreq: -9.0485 -8.1975 -0.0005 -0.0003 0.0002 5.2370 19.2221 32.2162 37.1785
frequency: 18.3878 32.1881 37.1636 62.5786 121.5046 182.0973 198.9541 217.2271 256.9556 277.7887 294.8728 322.4959 395.3882 409.2918 440.2652 479.9733 495.8991 513.7236 537.1933 552.2525 594.9288 623.1605 626.0080 657.0649 719.1366 738.0169 756.0107 759.3523 770.7172 788.4230 832.2311 870.0975 881.2703 915.8094 943.4130 956.3391 965.2755 976.1766 986.9991 991.7676 1022.7661 1062.9483 1095.5116 1125.0351 1127.7676 1158.3389 1171.3767 1182.3531 1186.5226 1235.5780 1257.4573 1268.6391 1275.2693 1289.1041 1322.2047 1360.2451 1403.5190 1410.3445 1424.9171 1434.4838 1462.2981 1466.6757 1515.1381 1581.3695 1605.8324 1614.5022 1641.5565 1667.3381 2987.4466 3046.9531 3065.8503 3111.5029 3114.8925 3118.5742 3123.7731 3137.6086 3141.4995 3161.1021 3473.9019 3497.1056 3611.3602
redmass: 5.0975 5.9253 7.5871 4.1944 5.2448 3.7213 4.7740 1.5847 2.8545 2.8506 2.3880 4.1576 3.2014 2.9134 4.4621 2.4861 2.7124 6.2267 2.9501 2.0654 3.0525 5.4511 1.4921 2.6464 4.1967 2.8599 1.7643 4.6927 2.3835 2.7496 1.3947 1.5346 3.5695 1.6992 2.7663 1.5053 2.0447 1.4080 3.9834 1.3993 2.2527 2.7153 1.6429 1.7211 1.5577 1.2846 1.0995 1.3808 1.4812 2.1818 1.5893 1.7905 1.7407 1.4459 1.2263 1.6326 2.0657 4.1187 3.9913 2.9241 1.1728 2.3237 3.6298 7.2279 5.4529 1.3220 6.7737 3.6716 1.0599 1.0962 1.0935 1.0866 1.0913 1.0858 1.0889 1.0973 1.0948 1.1004 1.0444 1.0637 1.0992
irintensity: 3.1995 1.3964 2.1005 1.2877 1.0261 1.1264 3.8158 45.4114 24.1630 7.3405 10.9520 0.8437 0.5547 0.5223 13.3717 22.4006 38.9890 1.4764 26.4581 218.4446 12.2518 13.6605 178.8056 59.4050 22.1495 29.2534 36.9938 0.1416 11.1123 0.8675 42.7147 13.2776 2.7636 2.7859 3.3234 1.8916 9.2671 9.5173 65.2839 4.1058 4.7421 211.1889 15.6065 7.2130 6.5869 4.7026 0.7055 6.2518 2.9776 3.0857 2.6132 6.5263 5.6166 4.5807 4.1589 4.2809 14.3870 4.4326 0.2981 1.8744 8.8663 2.7263 15.7339 0.3878 18.0012 129.8999 8.9388 106.0335 40.6549 3.3852 20.6654 6.5171 9.8074 6.9842 0.4213 21.6529 38.7874 35.7312 10.1518 16.6012 7.5436
temp: 298.150 k
press: 1.00000 atm
elementType: 8 8 7 6 6 6 6 6 6 6 6 6 6 6 6 6 1 1 1 1 1 1 1 1 1 1 1 1 1
symmnumber: 1
zpe: 605065.6 jmol-1
zpe.correction: 0.230457 hartree
zpe.thermalcorrener: 0.244795 hartree
zpe.thermalcorrenthalpy: 0.245739 hartree
zpe.thermalcorrgfe: 0.187096 hartree
zpe.sumelectzpe: -707.253062 hartree
zpe.sumelectthermal: -707.238724 hartree
zpe.sumelectthermalent: -707.237780 hartree
zpe.sumelectthermalfe: -707.296423 hartree
dipole: -0.5145 1.5152 -0.1509
dipole: 1.6073
quadrupole: -88.9896 -86.2564 -93.8809
quadrupole: 9.5185 -7.6422 -0.6729
quadrupole: 0.7193 3.4526 -4.1719 9.5185 -7.6422 -0.6729
hfenergy: -707.4835194 hartree
pointgroup: C01 [X(C13H13N1O2)]
dipole: -0.2203205 0.5926389 -0.0106677 debye
polarizability: 221.679045|30.1339808|146.7492546|-19.6486733|22.7327854|101.5380253 unknown
InChI: InChI=1S/C13H13NO2/c14-12(13(15)16)8-9-5-6-10-3-1-2-4-11(10)7-9/h1-7,12,15H,8,14H2
charge 0 multiplicity 1
29 atoms
O  2.265179 -1.075073 1.865191
O  3.073181 -1.886088 -0.154553
N  4.522172 0.649034 -0.090979
C  2.113801 0.985841 -0.891834
C  0.645338 0.893461 -0.516114
C  3.099216 0.545214 0.259355
C  -1.50375 -0.332364 -0.488347
C  -0.130009 -0.214424 -0.88084
C  -2.10356 0.723159 0.30326
C  0.037638 1.934225 0.267665
C  -1.296432 1.852392 0.664974
C  -2.307317 -1.462457 -0.857212
C  -3.478516 0.607994 0.693672
C  2.831618 -0.919027 0.603832
C  -3.644398 -1.548724 -0.461763
C  -4.235868 -0.504991 0.320448
H  2.384397 2.028191 -1.150022
H  2.335403 0.353023 -1.77176
H  2.901561 1.152896 1.15815
H  0.318172 -1.017483 -1.480536
H  0.638737 2.808369 0.548371
H  -1.746928 2.657046 1.258695
H  -1.854526 -2.261668 -1.456502
H  -3.928784 1.409454 1.291949
H  4.870478 1.602248 -0.21308
H  4.820133 -0.00072 -0.824628
H  -4.248411 -2.416557 -0.748955
H  -5.285669 -0.584849 0.623569
H  2.078741 -2.040323 2.030593
