program: Gaussian 09
title: 000250394
version: EM64L-G09RevD.01
frameworkgroup: C1[X(C6H13Cl2N2O2P)]
method: RPBEPBE
basis: SDD
operation: Freq
keyword: #p
keyword: freq=noraman
keyword: PBEPBE/SDD
title: #p freq=noraman PBEPBE/SDD
converged: YES YES NO NO
title: Mulliken charges:
elementType: Cl Cl P O O N N C C C C C C H H H H H H H H H H H H H
charge: -0.062866 -0.077746 1.340328 -0.469839 -0.592671 -0.722543 -0.722665 -0.357640 -0.364839 -0.008615 -0.285173 -0.575504 -0.559500 0.227888 0.234647 0.233060 0.207669 0.284195 0.337971 0.348486 0.239843 0.201469 0.273177 0.276990 0.307756 0.286123
chargesum: 0.00000
title: Mulliken charges with hydrogens summed into heavy atoms:
elementType: Cl Cl P O O N N C C C C C C
charge: -0.062866 -0.077746 1.340328 -0.469839 -0.592671 -0.374056 -0.384694 0.104894 0.075890 0.275580 0.156139 -0.025337 0.034378
polarizability: 1.40330446e+02 -2.59844567e+00 1.18740135e+02 -6.88675326e+00 4.39181620e-01 1.06656753e+02
1716.lowfreq: -17.6233 -7.1610 -4.5407 -0.0041 -0.0033 -0.0031 20.1449 29.3880 56.1243
frequency: 18.8420 29.0144 56.0731 63.8902 102.0807 117.5305 162.3233 183.0907 201.3073 233.6612 237.4757 265.6385 311.1517 340.9471 376.1871 399.9184 413.1869 420.4392 464.0180 508.7370 545.1144 574.5732 599.2112 651.8651 680.9131 766.3654 806.9555 819.3869 853.8045 873.7264 902.7548 925.7989 947.5495 974.8310 1038.7740 1052.0246 1065.7685 1090.4887 1110.2658 1114.5086 1124.4050 1190.5195 1212.3860 1216.6471 1240.7062 1264.7504 1271.6114 1296.1482 1340.5386 1341.9879 1348.3213 1356.0486 1366.7433 1401.2734 1434.6603 1436.8659 1440.7429 1454.3625 1469.1022 2979.2103 2990.2828 2995.3436 3003.4735 3060.1510 3066.2476 3067.4242 3072.4139 3088.6638 3157.2501 3159.5253 3476.1161 3569.7174
redmass: 7.3832 6.1328 8.7465 6.8280 4.6233 3.6332 3.7070 3.7725 4.4279 3.4745 4.3119 10.1248 1.9250 1.7229 4.2010 5.1233 5.6079 3.2941 3.0706 2.9767 1.9144 1.9932 6.1217 4.4135 5.1167 3.7215 2.2915 2.5747 3.0950 1.6938 2.7948 2.0192 2.4535 1.7153 2.6504 4.7634 2.1221 2.3448 2.3743 2.2788 1.2894 1.1877 1.4433 1.2649 1.1476 1.1916 1.3227 1.2174 1.3570 1.3352 1.2204 1.2429 1.2756 1.2680 1.0952 1.0931 1.0948 1.0828 1.0827 1.0658 1.0637 1.0623 1.0836 1.0991 1.0566 1.0569 1.1019 1.1008 1.1112 1.1126 1.0747 1.0769
irintensity: 3.1446 2.1692 0.6888 3.9628 0.0992 2.4874 5.3338 8.1608 14.7604 3.2882 4.5988 2.7710 2.3387 75.8725 44.2696 40.0730 4.9200 38.8484 2.0450 12.2057 13.9786 80.8740 42.5750 51.8284 97.2633 46.0997 37.7936 64.6761 145.7236 14.0563 40.9443 50.4779 22.5457 6.6597 72.4473 67.1358 54.6509 49.7080 45.2933 31.6085 20.4000 17.0061 24.2347 6.7187 10.6237 4.1919 5.3771 38.3749 3.6547 3.3834 2.1724 16.0850 34.9345 43.0339 25.6768 12.3536 13.0594 5.2072 9.8076 40.4314 32.9992 35.2594 0.6410 25.0226 14.5296 6.6110 36.4336 28.3793 5.2344 2.9886 35.0243 46.7754
temp: 298.150 k
press: 1.00000 atm
elementType: 17 17 15 8 8 7 7 6 6 6 6 6 6 1 1 1 1 1 1 1 1 1 1 1 1 1
symmnumber: 1
zpe: 527516.3 jmol-1
zpe.correction: 0.200920 hartree
zpe.thermalcorrener: 0.216022 hartree
zpe.thermalcorrenthalpy: 0.216966 hartree
zpe.thermalcorrgfe: 0.156141 hartree
zpe.sumelectzpe: -1756.671975 hartree
zpe.sumelectthermal: -1756.656874 hartree
zpe.sumelectthermalent: -1756.655930 hartree
zpe.sumelectthermalfe: -1756.716755 hartree
dipole: 4.0326 1.9183 -4.2331
dipole: 6.1531
quadrupole: -94.0266 -104.2322 -105.3729
quadrupole: 4.2024 -12.8697 1.4952
quadrupole: 7.1839 -3.0217 -4.1623 4.2024 -12.8697 1.4952
hfenergy: -1756.8728955 hartree
pointgroup: C01 [X(C6H13Cl2N2O2P1)]
dipole: -1.7121063 0.8909387 1.4612494 debye
dipolederiv: -0.5441856 -0.2449073 0.0608913 -0.2508142 -0.3603434 0.029265 0.173844 0.102833 -0.2133284 -0.3026743 0.1014327 -0.066109 0.1133843 -0.2909444 0.0998889 -0.1503242 0.1706892 -0.4008609 2.627802 -0.0578672 -0.1064742 -0.0612306 1.6965828 0.1190997 0.3436859 0.0261648 1.4673802 -0.8794516 0.2742176 0.0788731 0.3586808 -1.0476004 -0.049449 0.0467503 -0.1052838 -0.4891352 -0.808267 -0.0222575 0.0102484 -0.0054448 -0.6867125 -0.0965406 -0.0870036 -0.1117888 -0.6226061 -0.9295701 0.1727037 0.1153883 0.1755896 -0.7469258 0.00354 0.2110523 0.1139422 -0.8488989 -1.4168725 -0.1232905 -0.0140111 -0.2669489 -0.7377972 -0.154735 -0.1818819 -0.1901647 -0.5256438 0.2633853 -0.1019795 0.0324544 -0.3050334 0.4245063 0.2159798 -0.0427818 0.0789633 0.3263606 -0.0394444 0.0294039 0.0672256 0.0616589 -0.0412781 0.0443417 0.0729107 0.0626898 -0.0014589 0.515778 0.0482069 -0.00752 0.2640941 0.3212644 0.0151127 -0.2709387 0.118533 -0.0585851 0.5006412 -0.1487378 -0.0501712 -0.1671915 0.4925216 0.0757011 -0.2009884 0.3200721 0.2859328 0.58579 0.3476831 -0.1335823 0.2893862 0.2892881 -0.1369973 -0.2071323 -0.1862105 0.2343458 0.1094158 -0.135378 0.1740279 -0.133624 0.1665098 -0.2443474 0.2535907 -0.2660492 0.5023256 -0.0073347 -0.0385029 -0.1362397 0.011167 -0.0222024 -0.099379 -0.0731884 -0.0543222 -0.0359597 -0.0716706 -0.0428169 0.1278348 -0.0432894 0.0165388 0.0459307 0.1089235 0.0359784 0.0111382 -0.024259 -0.0507033 -0.0677526 -0.1094421 0.0412886 -0.0235421 -0.1100408 -0.010325 -0.0192708 0.023291 0.0863363 0.055229 0.1135706 -0.0621027 -0.0818449 0.0916082 -0.1034828 0.0194167 0.0774907 0.0465379 -0.0726548 0.0298088 0.0469678 0.037706 0.0033885 -0.0055887 0.0068533 0.1887215 -0.054522 -0.07217 -0.1250518 0.2128079 0.0617745 0.0008268 0.0589599 0.1861901 0.1472605 -0.0538718 0.0735195 0.0344111 0.212603 -0.0938886 0.078164 -0.1005115 0.2215722 0.0342109 0.0830641 -0.0127713 0.0680081 -0.076373 0.0787226 -0.0066743 0.0812213 -0.0024301 -0.0708287 -0.0816588 -0.0632429 -0.0430877 -0.0027876 -0.0482514 -0.0514021 -0.1416001 -0.0472898 0.0176713 -0.0653846 0.0083623 -0.0319014 0.0817529 0.0972194 -0.0080298 0.0199803 -0.0479743 -0.0549252 0.0711876 0.0549228 0.0517289 -0.0273293 0.0176415 0.052615 0.0189798 0.0709993 0.1224423 -0.0408584 -0.074536 -0.0095711 -0.0170759 0.0013378 -0.0575929 0.001845 -0.0164031 -0.0644171 0.0019628 0.0182574 -0.0188576 0.1168408 0.085714 0.0106194 0.0644751 -0.0026696 unknown
polarizability: 140.4318173|3.2125543|118.6297485|-5.8455351|-2.7911297|106.6657682 unknown
InChI: InChI=1S/C6H13Cl2N2O2P/c7-4-6(5-8)10-13(11)9-2-1-3-12-13/h6,9-10H,1-5H2
charge 0 multiplicity 1
26 atoms
Cl 3.541928 2.286664 -0.342944
Cl 3.156321 -1.558794 1.309314
P  -0.961505 -0.850756 -0.495754
O  -1.485616 0.6221 -1.287731
O  -0.695895 -2.015311 -1.544425
N  -2.146304 -1.171259 0.720719
N  0.382053 -0.258607 0.455306
C  -2.819787 -0.035922 1.408197
C  -3.289562 1.058631 0.416443
C  1.602532 0.230703 -0.222749
C  -2.118481 1.642251 -0.400479
C  2.08806 1.470026 0.548926
C  2.663709 -0.868601 -0.390602
H  -2.121902 0.407501 2.144791
H  -3.676691 -0.443877 1.97161
H  -4.044396 0.640069 -0.27486
H  -3.765728 1.883553 0.982217
H  1.317969 0.550567 -1.245895
H  0.56232 -0.776417 1.325484
H  -2.659336 -2.049106 0.622261
H  -2.458028 2.423522 -1.099442
H  -1.345244 2.062361 0.275339
H  2.458983 1.214711 1.553018
H  1.29658 2.230093 0.59377
H  2.258817 -1.726134 -0.947174
H  3.594707 -0.487268 -0.833139
